{"text_format":"1","workbook":"xlsx","n_sheets":14,"sheets":["NOMBRE","P1","P2","P3","P4","P5","P6","P7","P9","P11","P12","P13","Control","MACROS"],"not_rendered":{"charts":0,"images":0,"macros":1,"external_links":0,"defined_names":10,"comments":0,"pivot_tables":0},"unopened":[],"bounds":{"document_bytes":16777216,"sheet_cells":100000,"rows_first":2000,"rows_last":500,"rows_between":2000,"halvings":0,"cell_chars":16384,"cell_head_chars":4096},"cells_cut":0,"cells_raw":0,"read":"whole","date_system":"1900"}

{"sheet":"NOMBRE","index":0,"n_rows":40,"n_cols":33,"rows_kept":40,"cut":false,"hidden":false,"merged":[[16,1,18,1],[0,0,0,1],[0,2,0,7],[8,0,8,1],[14,0,14,1]]}
["DATOS DEL ESTABLECIMIENTO",null,"CÓDIGOS"]
["NOMBRE DE COMUNA",null,null,null,null,null,null,null,{"$f":"IF(OR(NOMBRE!C2=\"\",NOMBRE!D2=\"\",NOMBRE!E2=\"\",NOMBRE!F2=\"\",NOMBRE!G2=\"\"),\"Falta Cód. Com.\",\"\")","v":"Falta Cód. Com."},null,null,null,null,null,null,null,null,null,null,null,null,null,null,null,null,null,null,null,null,null,null,null,{"$f":"IF(I2>\"\",1,0)","v":1}]
["NOMBRE ESTABLECIMIENTO/ESTRATEGIA",null,null,null,null,null,null,null,{"$f":"IF(OR(NOMBRE!C3=\"\",NOMBRE!D3=\"\",NOMBRE!E3=\"\",NOMBRE!F3=\"\",NOMBRE!G3=\"\",NOMBRE!H3=\"\"),\"Falta Cód. Est.\",\"\")","v":"Falta Cód. Est."},null,null,null,null,null,null,null,null,null,null,null,null,null,null,null,null,null,null,null,null,null,null,null,{"$f":"IF(I3>\"\",1,0)","v":1}]
[null,null,null,null,null,null,null,null,null,null,null,null,null,null,null,null,null,null,null,null,null,null,null,null,null,null,null,null,null,null,null,null,{"$f":"IF(I4>\"\",1,0)","v":0}]
[null,null,null,null,null,null,null,null,null,null,null,null,null,null,null,null,null,null,null,null,null,null,null,null,null,null,null,null,null,null,null,null,{"$f":"IF(I5>\"\",1,0)","v":0}]
["MES:",null,null,null,null,null,null,null,{"$f":"IF(OR(NOMBRE!C6=\"\",NOMBRE!D6=\"\"),\"Falta Cód. Mes.\",\"\")","v":"Falta Cód. Mes."},null,null,null,null,null,null,null,null,null,null,null,null,null,null,null,null,null,null,null,null,null,null,null,{"$f":"IF(I6>\"\",1,0)","v":1}]
["AÑO:",2024,null,null,null,null,null,null,null,null,null,null,null,null,null,null,null,null,null,null,null,null,null,null,null,null,null,null,null,null,null,null,{"$f":"SUM(AG2:AG6)","v":3}]
[]
["Versión 1.0: Junio 2024"]
[]
["Director/a Servicio de Salud o Director/a Establecimiento",null,null,null,null,null,null,null,null,null,null,null,null,null,null,null,null,null,null,null,null,null,null,null,null,null,"JUNIO","Establecimiento de Mayor Complejidad (EMAYC)","SERVICIO DE SALUD"]
["Jefe/a de Estadísticas",null,null,null,null,null,null,null,null,null,null,null,null,null,null,null,null,null,null,null,null,null,null,null,null,null,"DICIEMBRE","Establecimiento de Mediana Complejidad (EMEDC)","MUNICIPAL"]
[null,null,null,null,null,null,null,null,null,null,null,null,null,null,null,null,null,null,null,null,null,null,null,null,null,null,null,"Establecimiento de Menor Complejidad (EMENC)","Organizaciones sin fines de lucro y ONG (Delegado)"]
[null,null,null,null,null,null,null,null,null,null,null,null,null,null,null,null,null,null,null,null,null,null,null,null,null,null,null,"Centros de Diagnóstico Terapeutico (CDT)"]
["MINSAL - DEIS",null,null,null,null,null,null,null,null,null,null,null,null,null,null,null,null,null,null,null,null,null,null,null,null,null,null,"Centro de Referencia de Salud (CRS)"]
[null,null,null,null,null,null,null,null,null,null,null,null,null,null,null,null,null,null,null,null,null,null,null,null,null,null,null,"Consultorio General Urbano (CGU)"]
[null,"SERIE P",null,null,null,null,null,null,null,null,null,null,null,null,null,null,null,null,null,null,null,null,null,null,null,null,null,"Consultorio General Urbano (CGU) - CESFAM"]
[null,null,null,null,null,null,null,null,null,null,null,null,null,null,null,null,null,null,null,null,null,null,null,null,null,null,null,"Consultorio General Urbano(CGU) con SAPU/SUR/SAR"]
[null,null,null,null,null,null,null,null,null,null,null,null,null,null,null,null,null,null,null,null,null,null,null,null,null,null,null,"Consultorio General Urbano (CGU) - CESFAM con SAPU/SAR"]
[null,null,null,null,null,null,null,null,null,null,null,null,null,null,null,null,null,null,null,null,null,null,null,null,null,null,null,"Consultorio General Rural (CGR)"]
[null,null,null,null,null,null,null,null,null,null,null,null,null,null,null,null,null,null,null,null,null,null,null,null,null,null,null,"Consultorio General Rural (CGR) - CESFAM"]
[null,null,null,null,null,null,null,null,null,null,null,null,null,null,null,null,null,null,null,null,null,null,null,null,null,null,null,"Consultorio General Rural (CGR) con SAPU/SAR/SUR"]
[null,null,null,null,null,null,null,null,null,null,null,null,null,null,null,null,null,null,null,null,null,null,null,null,null,null,null,"Consultorio General Rural (CGR) - CESFAM con SAPU/SAR/SUR"]
[null,null,null,null,null,null,null,null,null,null,null,null,null,null,null,null,null,null,null,null,null,null,null,null,null,null,null,"Posta de Salud Rural (PSR)"]
[null,null,null,null,null,null,null,null,null,null,null,null,null,null,null,null,null,null,null,null,null,null,null,null,null,null,null,"Centro Comunitario de Salud Familiar (CECOF)"]
[null,null,null,null,null,null,null,null,null,null,null,null,null,null,null,null,null,null,null,null,null,null,null,null,null,null,null,"Consultorio de Salud Mental (COSAM)"]
[null,null,null,null,null,null,null,null,null,null,null,null,null,null,null,null,null,null,null,null,null,null,null,null,null,null,null,"Programa de Reparación y Atención Integral de Salud (PRAIS)"]
[null,null,null,null,null,null,null,null,null,null,null,null,null,null,null,null,null,null,null,null,null,null,null,null,null,null,null,"Centro de Atención Funcionarios (CAF)"]
[null,null,null,null,null,null,null,null,null,null,null,null,null,null,null,null,null,null,null,null,null,null,null,null,null,null,null,"Unidad de Salud de Funcionarios (USF)"]
[null,null,null,null,null,null,null,null,null,null,null,null,null,null,null,null,null,null,null,null,null,null,null,null,null,null,null,"ClÍnica Dental Móvil (CDM)"]
[null,null,null,null,null,null,null,null,null,null,null,null,null,null,null,null,null,null,null,null,null,null,null,null,null,null,null,"Dirección Servicio de Salud (DSS)"]
[null,null,null,null,null,null,null,null,null,null,null,null,null,null,null,null,null,null,null,null,null,null,null,null,null,null,null,"Servicio de Atención Primaria de Urgencia (SAPU)"]
[null,null,null,null,null,null,null,null,null,null,null,null,null,null,null,null,null,null,null,null,null,null,null,null,null,null,null,"Servicio de Atención Primaria de Urgencia de Alta Resolutividad (SAR)"]
[null,null,null,null,null,null,null,null,null,null,null,null,null,null,null,null,null,null,null,null,null,null,null,null,null,null,null,"Servicio de Urgencia Rural (SUR)"]
[null,null,null,null,null,null,null,null,null,null,null,null,null,null,null,null,null,null,null,null,null,null,null,null,null,null,null,"Laboratorio Clínico o Dental"]
[null,null,null,null,null,null,null,null,null,null,null,null,null,null,null,null,null,null,null,null,null,null,null,null,null,null,null,"Servicio de Atención Primaria de Urgencia Dental (SAPUDENT)"]
[null,null,null,null,null,null,null,null,null,null,null,null,null,null,null,null,null,null,null,null,null,null,null,null,null,null,null,"Centro de Rehabilitación (CR)"]
[null,null,null,null,null,null,null,null,null,null,null,null,null,null,null,null,null,null,null,null,null,null,null,null,null,null,null,"Hospital de Campaña"]
[null,null,null,null,null,null,null,null,null,null,null,null,null,null,null,null,null,null,null,null,null,null,null,null,null,null,null,"Centro Oncologico"]
[null,null,null,null,null,null,null,null,null,null,null,null,null,null,null,null,null,null,null,null,null,null,null,null,null,null,null,"SAMU"]

{"sheet":"P1","index":1,"n_rows":164,"n_cols":96,"rows_kept":164,"cut":false,"hidden":false,"merged":[[86,8,87,8],[109,1,110,1],[96,1,96,2],[96,0,97,0],[96,3,97,3],[96,4,97,4],[50,2,51,2],[37,2,38,2],[90,0,90,1],[91,0,91,1],[88,0,88,1],[86,0,87,1],[86,2,87,2],[50,1,51,1],[8,18,9,18],[19,0,20,0],[23,0,23,1],[29,0,29,1],[24,0,24,1],[21,0,22,0],[8,17,9,17],[8,2,9,2],[8,16,9,16],[10,0,10,1],[8,3,8,15],[12,0,18,0],[25,0,26,0],[27,0,28,0],[8,0,9,1],[30,0,30,1],[86,9,87,9],[5,2,5,15],[77,0,77,4],[36,0,36,5],[57,0,57,11],[37,5,38,5],[50,0,51,0],[6,0,6,6],[37,4,38,4],[37,3,38,3],[37,0,38,0],[37,1,38,1],[31,0,32,0],[33,0,34,0],[35,0,35,1],[130,0,130,7],[84,0,84,1],[58,0,59,0],[58,1,59,1],[58,2,59,2],[60,0,64,0],[65,0,69,0],[58,3,58,11],[94,0,94,1],[109,0,110,0],[109,2,110,2],[92,0,92,1],[93,0,93,1],[109,3,109,11],[111,0,115,0],[86,3,86,7]]}
["DATOS DEL ESTABLECIMIENTO"]
[{"$f":"CONCATENATE(\"COMUNA: \",NOMBRE!$B$2,\" - \",\"( \",NOMBRE!$C$2,NOMBRE!$D$2,NOMBRE!$E$2,NOMBRE!$F$2,NOMBRE!$G$2,\" )\")","v":"COMUNA:  - (  )"}]
[{"$f":"CONCATENATE(\"ESTABLECIMIENTO/ESTRATEGIA: \",NOMBRE!$B$3,\" - \",\"( \",NOMBRE!$C$3,NOMBRE!$D$3,NOMBRE!$E$3,NOMBRE!$F$3,NOMBRE!$G$3,NOMBRE!$H$3,\" )\")","v":"ESTABLECIMIENTO/ESTRATEGIA:  - (  )"}]
[{"$f":"CONCATENATE(\"MES: \",NOMBRE!$B$6,\" - \",\"( \",NOMBRE!$C$6,NOMBRE!$D$6,\" )\")","v":"MES:  - (  )"}]
[{"$f":"CONCATENATE(\"AÑO: \",NOMBRE!$B$7)","v":"AÑO: 2024"}]
[null,null,"REM-P1. POBLACIÓN EN CONTROL PROGRAMA DE SALUD DE LA MUJER"]
["ATENCIÓN PRIMARIA DE SALUD"]
["SECCION A: POBLACIÓN EN CONTROL SEGÚN MÉTODO DE REGULACIÓN DE FERTILIDAD Y SALUD SEXUAL"]
["MÉTODOS",null,"TOTAL","GRUPO DE EDAD (en años)",null,null,null,null,null,null,null,null,null,null,null,null,"Pueblos Originarios"," Migrantes","PV-VIH (personas viviendo con VIH)"]
[null,null,null,"Menor \nde 15 años","15 a 19 años","20 a 24 años","25 a 29 años","30 a 34 años","35 a 39 años","40 a 44 años","45 a 49 años","50 a 54 años","55 a 59 años","60 a 64 años","65 a 69 años","70 y más años"]
["D . I . U T con Cobre",null,{"$f":"SUM(D11:M11)","v":0},null,null,null,null,null,null,null,null,null,null,null,null,null,null,null,null,{"$f":"($CA11&CB11&CC11&CD11&CE11&CF11&CG11&CH11&CI11)","v":""},null,null,null,null,null,null,null,null,null,null,null,null,null,null,null,null,null,null,null,null,null,null,null,null,null,null,null,null,null,null,null,null,null,null,null,null,null,null,null,null,null,null,null,null,null,null,null,null,null,null,null,null,null,null,null,null,null,null,{"$f":"IF($Q11>$C11,\"* La celda Pueblos Originarios debe ser menor o igual al Total de Métodos. \",\"\")","v":""},{"$f":"IF($R11>$C11,\"* La celda Población Migrantes debe ser menor o igual al Total de Métodos. \",\"\")","v":""},{"$f":"IF($S11>$C11,\"* La celda PV-VIH (Personas Viviendo con VIH) debe ser menor o igual al Total de Métodos. \",\"\")","v":""},{"$f":"IF(AND($C11<>0,$Q11=\"\"),\"* No olvide escribir en la celda de Pueblos Originarios (Digite CERO si no tiene). \",\"\")","v":""},{"$f":"IF(AND($C11<>0,$R11=\"\"),\"* No olvide escribir en la celda Migrantes (Digite CERO si no tiene). \",\"\")","v":""},{"$f":"IF(AND($C11<>0,$S11=\"\"),\"* No olvide escribir en la celda de PV-VIH (Personas Viviendo con VIH) (Digite CERO si no tiene). \",\"\")","v":""},null,null,null,{"$f":"IF($Q11>$C11,1,0)","v":0},{"$f":"IF($R11>$C11,1,0)","v":0},{"$f":"IF($S11>$C11,1,0)","v":0},{"$f":"IF(AND($C11<>0,$Q11=\"\"),1,0)","v":0},{"$f":"IF(AND($C11<>0,$R11=\"\"),1,0)","v":0},{"$f":"IF(AND($C11<>0,$S11=\"\"),1,0)","v":0}]
["D . I . U con Levonorgestrel",null,{"$f":"SUM(D12:M12)","v":0},null,null,null,null,null,null,null,null,null,null,null,null,null,null,null,null,{"$f":"($CA12&CB12&CC12&CD12&CE12&CF12&CG12&CH12&CI12)","v":""},null,null,null,null,null,null,null,null,null,null,null,null,null,null,null,null,null,null,null,null,null,null,null,null,null,null,null,null,null,null,null,null,null,null,null,null,null,null,null,null,null,null,null,null,null,null,null,null,null,null,null,null,null,null,null,null,null,null,{"$f":"IF($Q12>$C12,\"* La celda Pueblos Originarios debe ser menor o igual al Total de Métodos. \",\"\")","v":""},{"$f":"IF($R12>$C12,\"* La celda Población Migrantes debe ser menor o igual al Total de Métodos. \",\"\")","v":""},{"$f":"IF($S12>$C12,\"* La celda PV-VIH (Personas Viviendo con VIH) debe ser menor o igual al Total de Métodos. \",\"\")","v":""},{"$f":"IF(AND($C12<>0,$Q12=\"\"),\"* No olvide escribir en la celda de Pueblos Originarios (Digite CERO si no tiene). \",\"\")","v":""},{"$f":"IF(AND($C12<>0,$R12=\"\"),\"* No olvide escribir en la celda Migrantes (Digite CERO si no tiene). \",\"\")","v":""},{"$f":"IF(AND($C12<>0,$S12=\"\"),\"* No olvide escribir en la celda de PV-VIH (Personas Viviendo con VIH) (Digite CERO si no tiene). \",\"\")","v":""},null,null,null,{"$f":"IF($Q12>$C12,1,0)","v":0},0,0,0,0,{"$f":"IF(AND($C12<>0,$S12=\"\"),1,0)","v":0}]
["HORMONAL","Oral Combinado",0,null,null,null,null,null,null,null,null,null,null,null,null,null,null,null,null,"",null,null,null,null,null,null,null,null,null,null,null,null,null,null,null,null,null,null,null,null,null,null,null,null,null,null,null,null,null,null,null,null,null,null,null,null,null,null,null,null,null,null,null,null,null,null,null,null,null,null,null,null,null,null,null,null,null,null,"","","","","","",null,null,null,0,0,0,0,0,0]
[null,"Oral Progestágeno",0,null,null,null,null,null,null,null,null,null,null,null,null,null,null,null,null,"",null,null,null,null,null,null,null,null,null,null,null,null,null,null,null,null,null,null,null,null,null,null,null,null,null,null,null,null,null,null,null,null,null,null,null,null,null,null,null,null,null,null,null,null,null,null,null,null,null,null,null,null,null,null,null,null,null,null,"","","","","","",null,null,null,0,0,0,0,0,0]
[null,"Inyectable Combinado",0,null,null,null,null,null,null,null,null,null,null,null,null,null,null,null,null,"",null,null,null,null,null,null,null,null,null,null,null,null,null,null,null,null,null,null,null,null,null,null,null,null,null,null,null,null,null,null,null,null,null,null,null,null,null,null,null,null,null,null,null,null,null,null,null,null,null,null,null,null,null,null,null,null,null,null,"","","","","","",null,null,null,0,0,0,0,0,0]
[null,"Inyectable Progestágeno",0,null,null,null,null,null,null,null,null,null,null,null,null,null,null,null,null,"",null,null,null,null,null,null,null,null,null,null,null,null,null,null,null,null,null,null,null,null,null,null,null,null,null,null,null,null,null,null,null,null,null,null,null,null,null,null,null,null,null,null,null,null,null,null,null,null,null,null,null,null,null,null,null,null,null,null,"","","","","","",null,null,null,0,0,0,0,0,0]
[null,"Implante Etonogestrel (3 años)",0,null,null,null,null,null,null,null,null,null,null,null,null,null,null,null,null,"",null,null,null,null,null,null,null,null,null,null,null,null,null,null,null,null,null,null,null,null,null,null,null,null,null,null,null,null,null,null,null,null,null,null,null,null,null,null,null,null,null,null,null,null,null,null,null,null,null,null,null,null,null,null,null,null,null,null,"","","","","","",null,null,null,0,0,0,0,0,0]
[null,"Implante Levonorgestrel (5 años)",0,null,null,null,null,null,null,null,null,null,null,null,null,null,null,null,null,"",null,null,null,null,null,null,null,null,null,null,null,null,null,null,null,null,null,null,null,null,null,null,null,null,null,null,null,null,null,null,null,null,null,null,null,null,null,null,null,null,null,null,null,null,null,null,null,null,null,null,null,null,null,null,null,null,null,null,"","","","","","",null,null,null,0,0,0,0,0,0]
[null,"Anillo Vaginal",{"$f":"SUM(D19:M19)","v":0},null,null,null,null,null,null,null,null,null,null,null,null,null,null,null,null,"",null,null,null,null,null,null,null,null,null,null,null,null,null,null,null,null,null,null,null,null,null,null,null,null,null,null,null,null,null,null,null,null,null,null,null,null,null,null,null,null,null,null,null,null,null,null,null,null,null,null,null,null,null,null,null,null,null,null,"","","","","","",null,null,null,0,0,0,0,0,0]
[" SÓLO PRESERVATIVO  MAC                                                                                                                                                                                                                               ","Mujer",{"$f":"SUM(D20:P20)","v":0},null,null,null,null,null,null,null,null,null,null,null,null,null,null,null,null,"",null,null,null,null,null,null,null,null,null,null,null,null,null,null,null,null,null,null,null,null,null,null,null,null,null,null,null,null,null,null,null,null,null,null,null,null,null,null,null,null,null,null,null,null,null,null,null,null,null,null,null,null,null,null,null,null,null,null,"","","","","","",null,null,null,0,0,0,0,0,0]
[null,"Hombres",{"$f":"SUM(D21:P21)","v":0},null,null,null,null,null,null,null,null,null,null,null,null,null,null,null,null,"",null,null,null,null,null,null,null,null,null,null,null,null,null,null,null,null,null,null,null,null,null,null,null,null,null,null,null,null,null,null,null,null,null,null,null,null,null,null,null,null,null,null,null,null,null,null,null,null,null,null,null,null,null,null,null,null,null,null,"","","","","","",null,null,null,0,0,0,0,0,0]
["ESTERILIZACIÓN QUIRURGICA","Mujer",{"$f":"SUM(D22:M22)","v":0},null,null,null,null,null,null,null,null,null,null,null,null,null,null,null,null,"",null,null,null,null,null,null,null,null,null,null,null,null,null,null,null,null,null,null,null,null,null,null,null,null,null,null,null,null,null,null,null,null,null,null,null,null,null,null,null,null,null,null,null,null,null,null,null,null,null,null,null,null,null,null,null,null,null,null,"","","","","","",null,null,null,0,0,0,0,0,0]
[null,"Hombres",{"$f":"SUM(D23:M23)","v":0},null,null,null,null,null,null,null,null,null,null,null,null,null,null,null,null,"",null,null,null,null,null,null,null,null,null,null,null,null,null,null,null,null,null,null,null,null,null,null,null,null,null,null,null,null,null,null,null,null,null,null,null,null,null,null,null,null,null,null,null,null,null,null,null,null,null,null,null,null,null,null,null,null,null,null,"","","","","","",null,null,null,0,0,0,0,0,0]
[" TOTAL",null,{"$f":"SUM(D24:P24)","v":0},{"$f":"SUM(D11:D23)","v":0},{"$f":"SUM(E11:E23)","v":0},{"$f":"SUM(F11:F23)","v":0},{"$f":"SUM(G11:G23)","v":0},0,0,0,0,{"$f":"SUM(L11:L23)","v":0},0,null,null,null,0,0,0,null,null,null,null,null,null,null,null,null,null,null,null,null,null,null,null,null,null,null,null,null,null,null,null,null,null,null,null,null,null,null,null,null,null,null,null,null,null,null,null,null,null,null,null,null,null,null,null,null,null,null,null,null,null,null,null,null,null,null,"","","","","",""]
[" Mujeres en control con enfermedad cardiovascular (DM-HTA)",null,{"$f":"SUM(D25:P25)","v":0},null,null,null,null,null,null,null,null,null,null,null,null,null,null,null,null,"",null,null,null,null,null,null,null,null,null,null,null,null,null,null,null,null,null,null,null,null,null,null,null,null,null,null,null,null,null,null,null,null,null,null,null,null,null,null,null,null,null,null,null,null,null,null,null,null,null,null,null,null,null,null,null,null,null,null,{"$f":"IF($Q25>$C25,\"* La celda Pueblos Originarios debe ser menor o igual al Total de Métodos. \",\"\")","v":""},"","","","","",null,null,null,{"$f":"IF($Q25>$C25,1,0)","v":0},{"$f":"IF($R25>$C25,1,0)","v":0},{"$f":"IF($S25>$C25,1,0)","v":0},{"$f":"IF(AND($C25<>0,$Q25=\"\"),1,0)","v":0},{"$f":"IF(AND($C25<>0,$R25=\"\"),1,0)","v":0},{"$f":"IF(AND($C25<>0,$S25=\"\"),1,0)","v":0}]
["Mujeres con Retiro de Implante Anticipado en el semestre (antes de los 3 años)","En APS",{"$f":"SUM(D26:M26)","v":0},null,null,null,null,null,null,null,null,null,null,null,null,null,null,null,null,"",null,null,null,null,null,null,null,null,null,null,null,null,null,null,null,null,null,null,null,null,null,null,null,null,null,null,null,null,null,null,null,null,null,null,null,null,null,null,null,null,null,null,null,null,null,null,null,null,null,null,null,null,null,null,null,null,null,null,"","","","","","",null,null,null,0,0,0,0,0,0]
[null,"En Extrasistema ",{"$f":"SUM(D27:M27)","v":0},null,null,null,null,null,null,null,null,null,null,null,null,null,null,null,null,"",null,null,null,null,null,null,null,null,null,null,null,null,null,null,null,null,null,null,null,null,null,null,null,null,null,null,null,null,null,null,null,null,null,null,null,null,null,null,null,null,null,null,null,null,null,null,null,null,null,null,null,null,null,null,null,null,null,null,"","","","","","",null,null,null,0,0,0,0,0,0]
["Mujeres con Retiro de Implante Anticipado en el semestre (antes de los 5 años)","En APS",0,null,null,null,null,null,null,null,null,null,null,null,null,null,null,null,null,"",null,null,null,null,null,null,null,null,null,null,null,null,null,null,null,null,null,null,null,null,null,null,null,null,null,null,null,null,null,null,null,null,null,null,null,null,null,null,null,null,null,null,null,null,null,null,null,null,null,null,null,null,null,null,null,null,null,null,"","","","","","",null,null,null,0,0,0,0,0,0]
[null,"En Extrasistema ",0,null,null,null,null,null,null,null,null,null,null,null,null,null,null,null,null,"",null,null,null,null,null,null,null,null,null,null,null,null,null,null,null,null,null,null,null,null,null,null,null,null,null,null,null,null,null,null,null,null,null,null,null,null,null,null,null,null,null,null,null,null,null,null,null,null,null,null,null,null,null,null,null,null,null,null,"","","","","","",null,null,null,0,0,0,0,0,0]
["Método de Regulación de Fertilidad más Preservativo",null,{"$f":"SUM(D30:M30)","v":0},null,null,null,null,null,null,null,null,null,null,null,null,null,null,null,null,"",null,null,null,null,null,null,null,null,null,null,null,null,null,null,null,null,null,null,null,null,null,null,null,null,null,null,null,null,null,null,null,null,null,null,null,null,null,null,null,null,null,null,null,null,null,null,null,null,null,null,null,null,null,null,null,null,null,null,"","","","","","",null,null,null,0,0,0,0,0,0]
["Gestantes que reciben preservativo",null,{"$f":"SUM(D31:M31)","v":0},null,null,null,null,null,null,null,null,null,null,null,null,null,null,null,null,"",null,null,null,null,null,null,null,null,null,null,null,null,null,null,null,null,null,null,null,null,null,null,null,null,null,null,null,null,null,null,null,null,null,null,null,null,null,null,null,null,null,null,null,null,null,null,null,null,null,null,null,null,null,null,null,null,null,null,"","","","","","",null,null,null,0,0,0,0,0,0]
["PRESERVATIVO/PRACTICA SEXUAL SEGURA","Mujer",{"$f":"SUM(D32:P32)","v":0},null,null,null,null,null,null,null,null,null,null,null,null,null,null,null,null,"",null,null,null,null,null,null,null,null,null,null,null,null,null,null,null,null,null,null,null,null,null,null,null,null,null,null,null,null,null,null,null,null,null,null,null,null,null,null,null,null,null,null,null,null,null,null,null,null,null,null,null,null,null,null,null,null,null,null,"","","","","","",null,null,null,0,0,0,0,0,0]
[null,"Hombres",{"$f":"SUM(D33:P33)","v":0},null,null,null,null,null,null,null,null,null,null,null,null,null,null,null,null,"",null,null,null,null,null,null,null,null,null,null,null,null,null,null,null,null,null,null,null,null,null,null,null,null,null,null,null,null,null,null,null,null,null,null,null,null,null,null,null,null,null,null,null,null,null,null,null,null,null,null,null,null,null,null,null,null,null,null,"","","","","","",null,null,null,0,0,0,0,0,0]
["LUBRICANTES","Mujer",{"$f":"SUM(D34:P34)","v":0},null,null,null,null,null,null,null,null,null,null,null,null,null,null,null,null,"",null,null,null,null,null,null,null,null,null,null,null,null,null,null,null,null,null,null,null,null,null,null,null,null,null,null,null,null,null,null,null,null,null,null,null,null,null,null,null,null,null,null,null,null,null,null,null,null,null,null,null,null,null,null,null,null,null,null,"","","","","","",null,null,null,0,0,0,0,0,0]
[null,"Hombres",{"$f":"SUM(D35:P35)","v":0},null,null,null,null,null,null,null,null,null,null,null,null,null,null,null,null,"",null,null,null,null,null,null,null,null,null,null,null,null,null,null,null,null,null,null,null,null,null,null,null,null,null,null,null,null,null,null,null,null,null,null,null,null,null,null,null,null,null,null,null,null,null,null,null,null,null,null,null,null,null,null,null,null,null,null,"","","","","","",null,null,null,0,0,0,0,0,0]
["CONDON FEMENINO",null,{"$f":"SUM(D36:P36)","v":0},null,null,null,null,null,null,null,null,null,null,null,null,null,null,null,null,"",null,null,null,null,null,null,null,null,null,null,null,null,null,null,null,null,null,null,null,null,null,null,null,null,null,null,null,null,null,null,null,null,null,null,null,null,null,null,null,null,null,null,null,null,null,null,null,null,null,null,null,null,null,null,null,null,null,null,"","","","","","",null,null,null,0,0,0,0,0,0]
["SECCION B: GESTANTES EN CONTROL CON EVALUACIÓN RIESGO BIOPSICOSOCIAL "]
["GRUPOS DE EDAD","TOTAL DE GESTANTES EN CONTROL","EN RIESGO \nPSICO-\nSOCIAL","QUE PRESENTAN VIOLENCIA DE GÉNERO","GESTANTES QUE PRESENTAN ARO","MIGRANTES"]
[]
["Menos de 15 años",null,null,null,null,null,{"$f":"($CA40&$CB40&$CC40&$CD40&$CE40&$CF40)","v":""},null,null,null,null,null,null,null,null,null,null,null,null,null,null,null,null,null,null,null,null,null,null,null,null,null,null,null,null,null,null,null,null,null,null,null,null,null,null,null,null,null,null,null,null,null,null,null,null,null,null,null,null,null,null,null,null,null,null,null,null,null,null,null,null,null,null,null,null,null,null,null,{"$f":"IF($C40<$D40,\"* Las Gestantes Menores de 15 años con violencia de género deben estar incluidas en las Gestantes con riesgo psicosocial. \",\"\")","v":""},{"$f":"IF($B40<$C40,\"* Las Gestantes Menores de 15 años con Riesgo Psicosocial deben estar incluidas en el Total de Gestantes en Control misma edad. \",\"\")","v":""},{"$f":"IF($B40<$E40,\"* Las Gestantes Menores de 15 años que presentan ARO deben estar incluidas en el Total de Gestantes en Control misma edad. \",\"\")","v":""},{"$f":"IF($B40<$F40,\"* Las Gestantes que pertenecen a 'Población Migrantes' no debe ser mayor al Total de Gestantes en Control misma edad. \",\"\")","v":""},{"$f":"IF(AND(B40<>0,F40=\"\"),\"* No olvide escribir en la celda de 'Población Migrantes' (Digite CERO si no tiene). \",\"\")","v":""},null,null,null,null,{"$f":"IF($C40<$D40,1,0)","v":0},{"$f":"IF($B40<$C40,1,0)","v":0},{"$f":"IF($B40<$E40,1,0)","v":0},{"$f":"IF($B40<$F40,1,0)","v":0},{"$f":"IF(AND(B40<>0,F40=\"\"),1,0)","v":0}]
["15 a 19 años",null,null,null,null,null,{"$f":"($CA41&$CB41&$CC41&$CD41&$CE41&$CF41)","v":""},null,null,null,null,null,null,null,null,null,null,null,null,null,null,null,null,null,null,null,null,null,null,null,null,null,null,null,null,null,null,null,null,null,null,null,null,null,null,null,null,null,null,null,null,null,null,null,null,null,null,null,null,null,null,null,null,null,null,null,null,null,null,null,null,null,null,null,null,null,null,null,{"$f":"IF($C41<$D41,\"* Las Gestantes de 15 a 19 años con violencia de género deben estar incluidas en las Gestantes con riesgo psicosocial. \",\"\")","v":""},{"$f":"IF($B41<$C41,\"* Las Gestantes de 15 a 19 años con Riesgo Psicosocial deben estar incluidas en el Total de Gestantes en Control misma edad. \",\"\")","v":""},{"$f":"IF($B41<$E41,\"* Las Gestantes de 15 a 19 años que presentan ARO deben estar incluidas en el Total de Gestantes en Control misma edad. \",\"\")","v":""},{"$f":"IF($B41<$F41,\"* Las Gestantes que pertenecen a 'Población Migrantes' no debe ser mayor al Total de Gestantes en Control misma edad. \",\"\")","v":""},"",null,null,null,null,{"$f":"IF($C41<$D41,1,0)","v":0},{"$f":"IF($B41<$C41,1,0)","v":0},{"$f":"IF($B41<$E41,1,0)","v":0},{"$f":"IF($B41<$F41,1,0)","v":0},0]
["20 a 24 años",null,null,null,null,null,"",null,null,null,null,null,null,null,null,null,null,null,null,null,null,null,null,null,null,null,null,null,null,null,null,null,null,null,null,null,null,null,null,null,null,null,null,null,null,null,null,null,null,null,null,null,null,null,null,null,null,null,null,null,null,null,null,null,null,null,null,null,null,null,null,null,null,null,null,null,null,null,{"$f":"IF($C42<$D42,\"* Las Gestantes de 20 a 24 años con violencia de género deben estar incluidas en las Gestantes con riesgo psicosocial. \",\"\")","v":""},{"$f":"IF($B42<$C42,\"* Las Gestantes de 20 a 24 años con Riesgo Psicosocial deben estar incluidas en el Total de Gestantes en Control misma edad. \",\"\")","v":""},{"$f":"IF($B42<$E42,\"* Las Gestantes de 20 a 24 años que presentan ARO deben estar incluidas en el Total de Gestantes en Control misma edad. \",\"\")","v":""},"","",null,null,null,null,0,0,0,0,0]
["25 a 29 años",null,null,null,null,null,"",null,null,null,null,null,null,null,null,null,null,null,null,null,null,null,null,null,null,null,null,null,null,null,null,null,null,null,null,null,null,null,null,null,null,null,null,null,null,null,null,null,null,null,null,null,null,null,null,null,null,null,null,null,null,null,null,null,null,null,null,null,null,null,null,null,null,null,null,null,null,null,{"$f":"IF($C43<$D43,\"* Las Gestantes de 25 a 29 años con violencia de género deben estar incluidas en las Gestantes con riesgo psicosocial. \",\"\")","v":""},{"$f":"IF($B43<$C43,\"* Las Gestantes de 25 a 29 años con Riesgo Psicosocial deben estar incluidas en el Total de Gestantes en Control misma edad. \",\"\")","v":""},{"$f":"IF($B43<$E43,\"* Las Gestantes de 25 a 29 años que presentan ARO deben estar incluidas en el Total de Gestantes en Control misma edad. \",\"\")","v":""},"","",null,null,null,null,0,0,0,0,0]
["30 a 34 años",null,null,null,null,null,"",null,null,null,null,null,null,null,null,null,null,null,null,null,null,null,null,null,null,null,null,null,null,null,null,null,null,null,null,null,null,null,null,null,null,null,null,null,null,null,null,null,null,null,null,null,null,null,null,null,null,null,null,null,null,null,null,null,null,null,null,null,null,null,null,null,null,null,null,null,null,null,{"$f":"IF($C44<$D44,\"* Las Gestantes de 30 a 34 años con violencia de género deben estar incluidas en las Gestantes con riesgo psicosocial. \",\"\")","v":""},{"$f":"IF($B44<$C44,\"* Las Gestantes de 30 a 34 años con Riesgo Psicosocial deben estar incluidas en el Total de Gestantes en Control misma edad. \",\"\")","v":""},{"$f":"IF($B44<$E44,\"* Las Gestantes de 30 a 34 años que presentan ARO deben estar incluidas en el Total de Gestantes en Control misma edad. \",\"\")","v":""},"","",null,null,null,null,0,0,0,0,0]
["35 a 39 años",null,null,null,null,null,"",null,null,null,null,null,null,null,null,null,null,null,null,null,null,null,null,null,null,null,null,null,null,null,null,null,null,null,null,null,null,null,null,null,null,null,null,null,null,null,null,null,null,null,null,null,null,null,null,null,null,null,null,null,null,null,null,null,null,null,null,null,null,null,null,null,null,null,null,null,null,null,{"$f":"IF($C45<$D45,\"* Las Gestantes de 35 a 39 años con violencia de género deben estar incluidas en las Gestantes con riesgo psicosocial. \",\"\")","v":""},{"$f":"IF($B45<$C45,\"* Las Gestantes de 35 a 39 años con Riesgo Psicosocial deben estar incluidas en el Total de Gestantes en Control misma edad. \",\"\")","v":""},{"$f":"IF($B45<$E45,\"* Las Gestantes de 35 a 39 años que presentan ARO deben estar incluidas en el Total de Gestantes en Control misma edad. \",\"\")","v":""},"","",null,null,null,null,0,0,0,0,0]
["40 a 44 años",null,null,null,null,null,"",null,null,null,null,null,null,null,null,null,null,null,null,null,null,null,null,null,null,null,null,null,null,null,null,null,null,null,null,null,null,null,null,null,null,null,null,null,null,null,null,null,null,null,null,null,null,null,null,null,null,null,null,null,null,null,null,null,null,null,null,null,null,null,null,null,null,null,null,null,null,null,{"$f":"IF($C46<$D46,\"* Las Gestantes de 40 a 44 años con violencia de género deben estar incluidas en las Gestantes con riesgo psicosocial. \",\"\")","v":""},{"$f":"IF($B46<$C46,\"* Las Gestantes de 40 a 44 años con Riesgo Psicosocial deben estar incluidas en el Total de Gestantes en Control misma edad. \",\"\")","v":""},{"$f":"IF($B46<$E46,\"* Las Gestantes de 40 a 44 años que presentan ARO deben estar incluidas en el Total de Gestantes en Control misma edad. \",\"\")","v":""},"","",null,null,null,null,0,0,0,0,0]
["45 a 49 años",null,null,null,null,null,"",null,null,null,null,null,null,null,null,null,null,null,null,null,null,null,null,null,null,null,null,null,null,null,null,null,null,null,null,null,null,null,null,null,null,null,null,null,null,null,null,null,null,null,null,null,null,null,null,null,null,null,null,null,null,null,null,null,null,null,null,null,null,null,null,null,null,null,null,null,null,null,{"$f":"IF($C47<$D47,\"* Las Gestantes de 45 a 49 años con violencia de género deben estar incluidas en las Gestantes con riesgo psicosocial. \",\"\")","v":""},{"$f":"IF($B47<$C47,\"* Las Gestantes de 45 a 49 años con Riesgo Psicosocial deben estar incluidas en el Total de Gestantes en Control misma edad. \",\"\")","v":""},{"$f":"IF($B47<$E47,\"* Las Gestantes de 45 a 49 años que presentan ARO deben estar incluidas en el Total de Gestantes en Control misma edad. \",\"\")","v":""},"","",null,null,null,null,0,0,0,0,0]
["50 a 54 años",null,null,null,null,null,"",null,null,null,null,null,null,null,null,null,null,null,null,null,null,null,null,null,null,null,null,null,null,null,null,null,null,null,null,null,null,null,null,null,null,null,null,null,null,null,null,null,null,null,null,null,null,null,null,null,null,null,null,null,null,null,null,null,null,null,null,null,null,null,null,null,null,null,null,null,null,null,{"$f":"IF($C48<$D48,\"* Las Gestantes de 50 a 54 años con violencia de género deben estar incluidas en las Gestantes con riesgo psicosocial. \",\"\")","v":""},{"$f":"IF($B48<$C48,\"* Las Gestantes de 50 a 54 años con Riesgo Psicosocial deben estar incluidas en el Total de Gestantes en Control misma edad. \",\"\")","v":""},{"$f":"IF($B48<$E48,\"* Las Gestantes de 50 a 54 años que presentan ARO deben estar incluidas en el Total de Gestantes en Control misma edad. \",\"\")","v":""},"","",null,null,null,null,0,0,0,0,0]
["TOTAL",{"$f":"SUM(B40:B48)","v":0},{"$f":"SUM(C40:C48)","v":0},{"$f":"SUM(D40:D48)","v":0},{"$f":"SUM(E40:E48)","v":0},{"$f":"SUM(F40:F48)","v":0}]
["SECCION C: GESTANTES EN RIESGO PSICOSOCIAL CON VISITA DOMICILIARIA INTEGRAL REALIZADA EN EL SEMESTRE"]
["N° VDI","N° Gestantes \ncon VDI","TOTAL de Visitas"]
[]
["1 Visita",null,{"$f":"B53*1","v":0},{"$f":"($CA53&$CB53&$CC53&$CD53&$CE53&$CF53&$CG53&$CH53&$CI53)","v":""},null,null,null,null,null,null,null,null,null,null,null,null,null,null,null,null,null,null,null,null,null,null,null,null,null,null,null,null,null,null,null,null,null,null,null,null,null,null,null,null,null,null,null,null,null,null,null,null,null,null,null,null,null,null,null,null,null,null,null,null,null,null,null,null,null,null,null,null,null,null,null,null,null,null,{"$f":"IF($C$53<>$B$53*1,\"* NO ALTERE LAS FÓRMULAS, el Total de Visitas equivale a 1 visita por gestante. \",\"\")","v":""},null,null,null,null,null,null,null,null,{"$f":"IF($C$53<>$B$53*1,1,0)","v":0}]
["2 Visitas",null,{"$f":"B54*2","v":0},{"$f":"($CA54&$CB54&$CC54&$CD54&$CE54&$CF54&$CG54&$CH54&$CI54)","v":""},null,null,null,null,null,null,null,null,null,null,null,null,null,null,null,null,null,null,null,null,null,null,null,null,null,null,null,null,null,null,null,null,null,null,null,null,null,null,null,null,null,null,null,null,null,null,null,null,null,null,null,null,null,null,null,null,null,null,null,null,null,null,null,null,null,null,null,null,null,null,null,null,null,null,{"$f":"IF($C$54<>$B$54*2,\"* NO ALTERE LAS FÓRMULAS, el Total de Visitas equivale a 2 visitas por gestante. \",\"\")","v":""},null,null,null,null,null,null,null,null,{"$f":"IF($C$54<>$B$54*2,1,0)","v":0}]
["3 Visitas",null,{"$f":"B55*3","v":0},"",null,null,null,null,null,null,null,null,null,null,null,null,null,null,null,null,null,null,null,null,null,null,null,null,null,null,null,null,null,null,null,null,null,null,null,null,null,null,null,null,null,null,null,null,null,null,null,null,null,null,null,null,null,null,null,null,null,null,null,null,null,null,null,null,null,null,null,null,null,null,null,null,null,null,{"$f":"IF($C$55<>$B$55*3,\"* NO ALTERE LAS FÓRMULAS, el Total de Visitas equivale a 3 visitas por gestante. \",\"\")","v":""},null,null,null,null,null,null,null,null,{"$f":"IF($C$55<>$B$55*3,1,0)","v":0}]
["4 y más Visitas",null,null,""]
["TOTAL",{"$f":"SUM(B53:B56)","v":0},{"$f":"SUM(C53:C56)","v":0}]
["SECCION D: GESTANTES Y MUJERES DE 8° MES POST-PARTO EN CONTROL, SEGÚN ESTADO NUTRICIONAL"]
["POBLACION","ESTADO\nNUTRICIONAL","TOTAL","GRUPOS DE EDAD (en años)"]
[null,null,null,"Menos 15 años","15 a 19 años","20 a 24 años","25 a 29 años","30 a 34 años","35 a 39 años","40 a 44 años","45 a 49 años","50 a 54 años"]
["GESTANTES EN CONTROL\n(Información a la fecha de corte)","OBESA",{"$f":"SUM(D61:L61)","v":0}]
[null,"SOBREPESO",{"$f":"SUM(D62:L62)","v":0}]
[null,"NORMAL",{"$f":"SUM(D63:L63)","v":0}]
[null,"BAJO PESO",{"$f":"SUM(D64:L64)","v":0}]
[null,"TOTAL",{"$f":"SUM(D65:L65)","v":0},{"$f":"SUM(D61:D64)","v":0},{"$f":"SUM(E61:E64)","v":0},0,0,0,0,0,0,0,{"$f":" CA65 & CB65 & CC65 & CD65 & CE65 & CF65 & CG65 &CH65&CI65","v":""},null,null,null,null,null,null,null,null,null,null,null,null,null,null,null,null,null,null,null,null,null,null,null,null,null,null,null,null,null,null,null,null,null,null,null,null,null,null,null,null,null,null,null,null,null,null,null,null,null,null,null,null,null,null,null,null,null,null,null,null,null,null,null,null,null,{"$f":"IF($B$40<>$D65,\"* Las Gestantes Menores de 15 años, según Estado Nutricional debe ser igual al Total de gestantes en Control de esa edad en Sección B. \",\"\")","v":""},{"$f":"IF($B$41<>$E65,\"* Las gestantes 15-19 años, según Estado Nutricional debe ser igual al Total de gestantes en Control de esa edad en Sección B. \",\"\")","v":""},{"$f":"IF($B$42<>$F65,\"* Las gestantes20-24 años, según Estado Nutricional debe ser igual al Total de gestantes en Control de esa edad en Sección B. \",\"\")","v":""},{"$f":"IF($B$43<>$G65,\"* Las gestantes 25-29 años, según Estado Nutricional debe ser igual al Total de gestantes en Control de esa edad en Sección B. \",\"\")","v":""},{"$f":"IF($B$44<>$H65,\"* Las gestantes30-34 años, según Estado Nutricional debe ser igual al Total de gestantes en Control de esa edad en Sección B. \",\"\")","v":""},{"$f":"IF($B$45<>$I65,\"* Las gestantes 35-39 años, según Estado Nutricional debe ser igual al Total de gestantes en Control de esa edad en Sección B. \",\"\")","v":""},{"$f":"IF($B$46<>$J65,\"* Las gestantes 40-44 años, según Estado Nutricional debe ser igual al Total de gestantes en Control de esa edad en Sección B. \",\"\")","v":""},{"$f":"IF($B$47<>$K65,\"* Las gestantes 45-49 años, según Estado Nutricional debe ser igual al Total de gestantes en Control de esa edad en Sección B. \",\"\")","v":""},{"$f":"IF($B$48<>$L65,\"* Las gestantes 50-54 años, según Estado Nutricional debe ser igual al Total de gestantes en Control de esa edad en Sección B. \",\"\")","v":""},{"$f":"IF($B$40<>$D65,1,0)","v":0},{"$f":"IF($B$41<>$E65,1,0)","v":0},{"$f":"IF($B$42<>$F65,1,0)","v":0},{"$f":"IF($B$43<>$G65,1,0)","v":0},{"$f":"IF($B$44<>$H65,1,0)","v":0},{"$f":"IF($B$45<>$I65,1,0)","v":0},{"$f":"IF($B$46<>$J65,1,0)","v":0},{"$f":"IF($B$47<>$K65,1,0)","v":0},{"$f":"IF($B$48<>$L65,1,0)","v":0}]
["CONTROL AL 8º MES POST-PARTO\n(Información del semestre)","OBESA",{"$f":"SUM(D66:L66)","v":0}]
[null,"SOBREPESO",0]
[null,"NORMAL",0]
[null,"BAJO PESO",0]
[null,"TOTAL",{"$f":"SUM(D70:L70)","v":0},{"$f":"SUM(D66:D69)","v":0},{"$f":"SUM(E66:E69)","v":0},{"$f":"SUM(F66:F69)","v":0},{"$f":"SUM(G66:G69)","v":0},0,0,{"$f":"SUM(J66:J69)","v":0},0,0]
["SECCION E: MUJERES Y GESTANTES EN CONTROL CON CONSULTA NUTRICIONAL "]
["MUJERES","TOTAL"]
["Gestantes con malnutrición por déficit (bajo peso)",null,null,null,null,null,null,null,null,null,null,null,null,null,null,null,null,null,null,null,null,null,null,null,null,null,null,null,null,null,null,null,null,null,null,null,null,null,null,null,null,null,null,null,null,null,null,null,null,null,null,null,null,null,null,null,null,null,null,null,null,null,null,null,null,null,null,null,null,null,null,null,null,null,null,null,null,null,{"$f":"IF($B$73<=$C$64,\"\",\"* Gestantes malnutricion no debe ser mayor que Gestantes en Control Bajo Peso (Seccion D). \")","v":""},null,null,null,null,null,null,null,null,{"$f":"IF($B$73<=$C$64,0,1)","v":0}]
["Gestantes con malnutrición por exceso - Obesa",null,null,null,null,null,null,null,null,null,null,null,null,null,null,null,null,null,null,null,null,null,null,null,null,null,null,null,null,null,null,null,null,null,null,null,null,null,null,null,null,null,null,null,null,null,null,null,null,null,null,null,null,null,null,null,null,null,null,null,null,null,null,null,null,null,null,null,null,null,null,null,null,null,null,null,null,null,{"$f":"IF($B$74<=$C$61,\"\",\"* Gestantes malnutricion  por exceso - Obesa no debe ser mayor que Gestantes en Control Obesa (Seccion D). \")","v":""},null,null,null,null,null,null,null,null,{"$f":"IF($B$74<=$C$61,0,1)","v":0}]
["Gestantes con malnutrición por exceso - Sobrepeso",null,null,null,null,null,null,null,null,null,null,null,null,null,null,null,null,null,null,null,null,null,null,null,null,null,null,null,null,null,null,null,null,null,null,null,null,null,null,null,null,null,null,null,null,null,null,null,null,null,null,null,null,null,null,null,null,null,null,null,null,null,null,null,null,null,null,null,null,null,null,null,null,null,null,null,null,null,{"$f":"IF($B$75<=$C$62,\"\",\"* Gestantes malnutricion por exceso - Sobrepeso no debe ser mayor que Gestantes en Control Sobrepeso (Seccion D). \")","v":""},null,null,null,null,null,null,null,null,{"$f":"IF($B$75<=$C$62,0,1)","v":0}]
["En 3º mes post parto"]
["En 6º mes post parto"]
["SECCION F: MUJERES EN CONTROL DE CLIMATERIO "]
["Población","45 a 64 años"]
["Población en Control"]
["Mujeres con pauta aplicada MRS*",null,null,null,null,null,null,null,null,null,null,null,null,null,null,null,null,null,null,null,null,null,null,null,null,null,null,null,null,null,null,null,null,null,null,null,null,null,null,null,null,null,null,null,null,null,null,null,null,null,null,null,null,null,null,null,null,null,null,null,null,null,null,null,null,null,null,null,null,null,null,null,null,null,null,null,null,null,{"$f":"IF($B81>$B80,\"* El Nº de mujeres con pauta aplicada MRS* no debe ser mayor a la población de mujeres en control de climaterio. \",\"\")","v":""},null,null,null,null,null,null,null,null,{"$f":"IF($B81>$B80,1,0)","v":0}]
["Mujeres con MRS elevado*",null,null,null,null,null,null,null,null,null,null,null,null,null,null,null,null,null,null,null,null,null,null,null,null,null,null,null,null,null,null,null,null,null,null,null,null,null,null,null,null,null,null,null,null,null,null,null,null,null,null,null,null,null,null,null,null,null,null,null,null,null,null,null,null,null,null,null,null,null,null,null,null,null,null,null,null,null,{"$f":"IF($B82>$B81,\"* El Nº de Mujeres con MRS elevado* no debe ser mayor al Nº de Mujeres con pauta aplicada MRS*. \",\"\")","v":""},null,null,null,null,null,null,null,null,{"$f":"IF($B82>$B81,1,0)","v":0}]
["Mujeres con aplicación de terapia hormonal de la menopausia según MRS*",null,null,null,null,null,null,null,null,null,null,null,null,null,null,null,null,null,null,null,null,null,null,null,null,null,null,null,null,null,null,null,null,null,null,null,null,null,null,null,null,null,null,null,null,null,null,null,null,null,null,null,null,null,null,null,null,null,null,null,null,null,null,null,null,null,null,null,null,null,null,null,null,null,null,null,null,null,{"$f":"IF($B83>$B82,\"* El Nº de Mujeres con aplicación de terapia hormonal de la menopausia según MRS* no debe ser mayor que el numero de Mujeres con MRS elevado*. \",\"\")","v":""},null,null,null,null,null,null,null,null,{"$f":"IF($B83>$B82,1,0)","v":0}]
["Mujeres que asisten a Talleres Educativos"]
["* MRS: Menopause Rating Scale"]
["SECCION F.1: POBLACIÓN EN CONTROL CLIMATERIO SEGÚN TIPO TERAPIA REEMPLAZO HORMONAL"]
["MÉTODOS",null,"TOTAL","GRUPO DE EDAD (en años)",null,null,null,null,"Pueblos Originarios"," Migrantes"]
[null,null,null,"Menor \nde 45 años","45 a 49 años","50 a 54 años","55 a 60 años","60 a 64 años"]
["Estradiol Micronizado 1mg",null,{"$f":"SUM(D89:H89)","v":0},null,null,null,null,null,null,null,{"$f":"($CA89&$CB89&$CC89&$CD89&$CE89&$CF89&$CG89&$CH89&$CI89)","v":""},null,null,null,null,null,null,null,null,null,null,null,null,null,null,null,null,null,null,null,null,null,null,null,null,null,null,null,null,null,null,null,null,null,null,null,null,null,null,null,null,null,null,null,null,null,null,null,null,null,null,null,null,null,null,null,null,null,null,null,null,null,null,null,null,null,null,null,{"$f":"IF($I89>$C89,\"* La celda 'Pueblos Originarios' debe ser menor o igual al Total en control. \",\"\")","v":""},{"$f":"IF($J89>$C89,\"* La celda 'Población Migrantes' debe ser menor o igual al Total en control. \",\"\")","v":""},{"$f":"IF(AND($C89<>0,$I89=\"\"),\"* No olvide escribir en la celda de 'Pueblos Originarios' (Digite CERO si no tiene). \",\"\")","v":""},{"$f":"IF(AND($C89<>0,$J89=\"\"),\"* No olvide escribir en la celda de 'Población Migrantes' (Digite CERO si no tiene). \",\"\")","v":""},null,null,null,null,null,{"$f":"IF($I89>$C89,1,0)","v":0},{"$f":"IF($J89>$C89,1,0)","v":0},{"$f":"IF(AND($C89<>0,$I89=\"\"),1,0)","v":0},{"$f":"IF(AND($C89<>0,$J89=\"\"),1,0)","v":0}]
["Estradiol Gel",null,{"$f":"SUM(D90:H90)","v":0},null,null,null,null,null,null,null,{"$f":"($CA90&$CB90&$CC90&$CD90&$CE90&$CF90&$CG90&$CH90&$CI90)","v":""},null,null,null,null,null,null,null,null,null,null,null,null,null,null,null,null,null,null,null,null,null,null,null,null,null,null,null,null,null,null,null,null,null,null,null,null,null,null,null,null,null,null,null,null,null,null,null,null,null,null,null,null,null,null,null,null,null,null,null,null,null,null,null,null,null,null,null,{"$f":"IF($I90>$C90,\"* La celda 'Pueblos Originarios' debe ser menor o igual al Total en control. \",\"\")","v":""},{"$f":"IF($J90>$C90,\"* La celda 'Población Migrantes' debe ser menor o igual al Total en control. \",\"\")","v":""},{"$f":"IF(AND($C90<>0,$I90=\"\"),\"* No olvide escribir en la celda de 'Pueblos Originarios' (Digite CERO si no tiene). \",\"\")","v":""},{"$f":"IF(AND($C90<>0,$J90=\"\"),\"* No olvide escribir en la celda de 'Población Migrantes' (Digite CERO si no tiene). \",\"\")","v":""},null,null,null,null,null,0,0,0,0]
["Progesterona Micronizada 100mg",null,0,null,null,null,null,null,null,null,"",null,null,null,null,null,null,null,null,null,null,null,null,null,null,null,null,null,null,null,null,null,null,null,null,null,null,null,null,null,null,null,null,null,null,null,null,null,null,null,null,null,null,null,null,null,null,null,null,null,null,null,null,null,null,null,null,null,null,null,null,null,null,null,null,null,null,null,"","","","",null,null,null,null,null,0,0,0,0]
["Progesterona Micronizada 200mg",null,0,null,null,null,null,null,null,null,"",null,null,null,null,null,null,null,null,null,null,null,null,null,null,null,null,null,null,null,null,null,null,null,null,null,null,null,null,null,null,null,null,null,null,null,null,null,null,null,null,null,null,null,null,null,null,null,null,null,null,null,null,null,null,null,null,null,null,null,null,null,null,null,null,null,null,null,"","","","",null,null,null,null,null,0,0,0,0]
["Nomegestrol 5mg comp.",null,0,null,null,null,null,null,null,null,"",null,null,null,null,null,null,null,null,null,null,null,null,null,null,null,null,null,null,null,null,null,null,null,null,null,null,null,null,null,null,null,null,null,null,null,null,null,null,null,null,null,null,null,null,null,null,null,null,null,null,null,null,null,null,null,null,null,null,null,null,null,null,null,null,null,null,null,"","","","",null,null,null,null,null,0,0,{"$f":"IF(AND($C93<>0,$I93=\"\"),1,0)","v":0},0]
["Tibolona 2,5mg comp.",null,0,null,null,null,null,null,null,null,"",null,null,null,null,null,null,null,null,null,null,null,null,null,null,null,null,null,null,null,null,null,null,null,null,null,null,null,null,null,null,null,null,null,null,null,null,null,null,null,null,null,null,null,null,null,null,null,null,null,null,null,null,null,null,null,null,null,null,null,null,null,null,null,null,null,null,null,"","","",{"$f":"IF(AND($C94<>0,$J94=\"\"),\"* No olvide escribir en la celda de 'Población Migrantes' (Digite CERO si no tiene). \",\"\")","v":""},null,null,null,null,null,0,0,0,0]
["Terapia Dual",null,0,null,null,null,null,null,null,null,"",null,null,null,null,null,null,null,null,null,null,null,null,null,null,null,null,null,null,null,null,null,null,null,null,null,null,null,null,null,null,null,null,null,null,null,null,null,null,null,null,null,null,null,null,null,null,null,null,null,null,null,null,null,null,null,null,null,null,null,null,null,null,null,null,null,null,null,{"$f":"IF($I95>$C95,\"* La celda 'Pueblos Originarios' debe ser menor o igual al Total en control. \",\"\")","v":""},{"$f":"IF($J95>$C95,\"* La celda 'Población Migrantes' debe ser menor o igual al Total en control. \",\"\")","v":""},{"$f":"IF(AND($C95<>0,$I95=\"\"),\"* No olvide escribir en la celda de 'Pueblos Originarios' (Digite CERO si no tiene). \",\"\")","v":""},{"$f":"IF(AND($C95<>0,$J95=\"\"),\"* No olvide escribir en la celda de 'Población Migrantes' (Digite CERO si no tiene). \",\"\")","v":""},null,null,null,null,null,0,0,0,0]
["SECCION G: GESTANTES EN CONTROL CON ECOGRAFÍA POR TRIMESTRE DE GESTACION (EN EL SEMESTRE)"]
["Población","Primer trimestre",null,"Segundo trimestre 22-24 semanas","Tercer trimestre 30-34 semanas"]
[null,"<11 semanas","11- 13+6 semanas"]
["Menor de 15"]
["15 - 19 "]
["20 - 24"]
["25 - 29"]
["30 - 34"]
["35 - 39"]
["40 - 44"]
["45 - 49"]
["50 - 54"]
["TOTAL",{"$f":"SUM(B99:B107)","v":0},{"$f":"SUM(C99:C107)","v":0},{"$f":"SUM(D99:D107)","v":0},{"$f":"SUM(E99:E107)","v":0}]
["SECCION H: MUJERES BAJO CONTROL DE REGULACIÓN DE FERTILIDAD SEGÚN ESTADO NUTRICIONAL "]
["POBLACION","ESTADO\nNUTRICIONAL","TOTAL","GRUPOS DE EDAD (en años)"]
[null,null,null,"Menos 15 años","15 a 19 años","20 a 24 años","25 a 29 años","30 a 34 años","35 a 39 años","40 a 44 años","45 a 49 años","50 a 54 años"]
["MUJERES BAJO CONTROL DE REGULACIÓN DE FERTILIDAD SEGÚN ESTADO NUTRICIONAL ","OBESA",{"$f":"SUM(D112:L112)","v":0}]
[null,"SOBREPESO",{"$f":"SUM(D113:L113)","v":0}]
[null,"NORMAL",{"$f":"SUM(D114:L114)","v":0}]
[null,"BAJO PESO",{"$f":"SUM(D115:L115)","v":0}]
[null,"TOTAL",{"$f":"SUM(D116:L116)","v":0},{"$f":"SUM(D112:D115)","v":0},{"$f":"SUM(E112:E115)","v":0},0,0,0,0,0,0,0]
["SECCION I: GESTANTES EN CONTROL CON TEST DE VIH/SIFILIS TOMADO (EN EL SEMESTRE, RED PÚBLICA O EXTRASISTEMA)"]
["Población","TOTAL GESTANTES BAJO CONTROL","GESTANTES EN CONTROL CON RESULTADO 1° VIH","GESTANTES EN CONTROL CON RESULTADO 1° TAMIZAJE SIFILIS","TOTAL GESTANTES EN CONTROL >34 SEM","GESTANTES EN CONTROL CON RESULTADO 2° VIH","GESTANTES EN CONTROL CON RESULTADO TAMIZAJE SIFILIS 3° TRIMESTRE GESTACION "]
["Menor de 15"]
["15 - 19 "]
["20 - 24"]
["25 - 29"]
["30 - 34"]
["35 - 39"]
["40 - 44"]
["45 - 49"]
["50 - 54"]
["TOTAL",{"$f":"SUM(B119:B127)","v":0},0,0,0,0,0]
["Gestantes con Tamizajes resultado pendiente"]
["NIVEL SECUNDARIO"]
["SECCIÓN J: POBLACIÓN EN CONTROL POR PATOLOGÍAS DE ALTO RIESGO OBSTÉTRICO"]
["PATOLOGÍA","TOTAL"]
["Preeclampsia (PE) "]
["Sindrome Hipertensivo del Embarazo (SHE)"]
["Factores de riesgo y condicionantes de Parto Prematuro"]
["Retardo Crecimiento Intrauterino (RCIU)"]
["Sífilis"]
["VIH"]
["Diabetes Pre Gestacional"]
["Diabetes Gestacional"]
["Cesárea anterior"]
["Malformación Congénita"]
["Anemia"]
["Cardiopatías"]
["Pielonefritis"]
["Rh(-) sensibilizada"]
["Placenta previa"]
["Chagas"]
["Colestasia Intrahépatica de Embarazo"]
["Otras patologías del embarazo"]
["TOTAL",{"$f":"SUM(B133:B150)","v":0}]
[]
[]
[]
[]
[]
[]
[]
[]
[]
[]
[]
[{"$f":"SUM(C11:C36,B49:F49,B57:C57,C61:C70,B73:B77,B80:B84,C89:C95,B108:E108,C112:C116,B128:G129,B133:B151)","v":0},"datos"]
[{"$f":"SUM(CJ11:CR95)","v":0},"errores"]

{"sheet":"P2","index":2,"n_rows":220,"n_cols":126,"rows_kept":220,"cut":false,"hidden":false,"merged":[[7,33,8,34],[7,35,8,36],[8,21,8,22],[8,23,8,24],[8,25,8,26],[8,27,8,28],[8,31,8,32],[30,0,37,0],[201,0,201,1],[198,29,199,30],[198,31,199,32],[199,5,199,6],[199,7,199,8],[199,9,199,10],[199,11,199,12],[199,13,199,14],[199,15,199,16],[199,17,199,18],[199,19,199,20],[199,21,199,22],[199,23,199,24],[153,0,153,1],[170,0,170,1],[198,2,199,4],[202,0,204,0],[205,0,211,0],[212,0,212,1],[165,0,165,1],[154,0,154,1],[172,0,172,1],[181,0,181,1],[163,0,163,1],[157,0,157,1],[162,0,162,1],[183,0,183,1],[184,0,184,1],[185,0,185,1],[186,0,186,1],[164,0,164,1],[178,0,178,1],[179,0,179,1],[198,0,200,1],[193,0,193,1],[194,0,194,1],[195,0,195,1],[196,0,196,1],[182,0,182,1],[168,0,168,1],[198,5,198,24],[198,25,199,26],[198,27,199,28],[188,0,188,1],[155,0,155,1],[156,0,156,1],[180,0,180,1],[159,0,159,1],[174,0,174,1],[187,0,187,1],[158,0,158,1],[173,0,173,1],[177,0,177,1],[190,2,191,4],[176,0,176,1],[167,0,167,1],[169,0,169,1],[190,0,192,1],[171,0,171,1],[175,0,175,1],[190,43,191,44],[190,45,191,46],[191,5,191,6],[191,7,191,8],[191,9,191,10],[191,11,191,12],[191,13,191,14],[191,15,191,16],[191,17,191,18],[191,19,191,20],[191,21,191,22],[191,23,191,24],[191,25,191,26],[191,27,191,28],[191,29,191,30],[191,31,191,32],[191,33,191,34],[191,35,191,36],[191,37,191,38],[191,39,191,40],[191,41,191,42],[190,5,190,42],[144,0,144,1],[161,0,161,1],[130,0,130,1],[112,2,113,2],[119,0,119,1],[122,0,122,1],[117,2,118,2],[121,0,121,1],[117,0,118,1],[115,0,115,1],[126,2,127,4],[160,0,160,1],[114,0,114,1],[112,0,113,1],[124,0,124,1],[133,0,133,1],[152,0,152,1],[123,0,123,1],[120,0,120,1],[126,0,128,1],[129,0,129,1],[147,0,147,1],[146,0,146,1],[148,0,148,1],[149,0,149,1],[150,0,150,1],[151,0,151,1],[141,0,143,1],[166,0,166,1],[73,0,73,19],[105,12,106,12],[105,13,106,13],[83,0,89,0],[76,0,82,0],[105,11,106,11],[105,6,106,6],[105,5,106,5],[90,0,96,0],[105,0,106,1],[105,2,106,2],[105,8,106,8],[97,0,103,0],[131,0,131,1],[105,10,106,10],[105,7,106,7],[105,9,106,9],[135,2,136,2],[107,0,110,0],[41,13,41,14],[52,0,58,0],[59,0,62,0],[41,17,41,18],[40,0,42,1],[41,15,41,16],[41,7,41,8],[41,9,41,10],[41,11,41,12],[40,5,40,18],[43,0,43,1],[44,0,51,0],[40,2,41,4],[41,5,41,6],[39,0,39,12],[17,0,22,0],[10,0,10,1],[11,0,16,0],[23,0,29,0],[5,0,5,23],[8,15,8,16],[8,17,8,18],[8,7,8,8],[8,9,8,10],[8,11,8,12],[7,0,9,1],[8,5,8,6],[8,13,8,14],[7,2,8,4],[8,19,8,20],[38,0,38,1],[135,0,136,1],[141,45,142,46],[142,33,142,34],[142,39,142,40],[142,41,142,42],[142,31,142,32],[142,19,142,20],[142,21,142,22],[142,23,142,24],[142,25,142,26],[142,27,142,28],[142,29,142,30],[142,35,142,36],[142,37,142,38],[141,5,141,42],[141,43,142,44],[142,15,142,16],[142,17,142,18],[132,0,132,1],[141,2,142,4],[75,0,75,1],[135,3,135,8],[8,29,8,30],[7,5,7,32],[72,0,72,1],[63,0,71,0],[145,0,145,1],[127,9,127,10],[142,5,142,6],[142,7,142,8],[142,9,142,10],[142,11,142,12],[142,13,142,14],[126,5,126,10],[126,11,128,11],[127,5,127,6],[127,7,127,8],[105,4,106,4],[105,3,106,3],[139,0,139,1],[138,0,138,1],[137,0,137,1]]}
["DATOS DEL ESTABLECIMIENTO"]
[{"$f":"CONCATENATE(\"COMUNA: \",NOMBRE!$B$2,\" - \",\"( \",NOMBRE!$C$2,NOMBRE!$D$2,NOMBRE!$E$2,NOMBRE!$F$2,NOMBRE!$G$2,\" )\")","v":"COMUNA:  - (  )"}]
[{"$f":"CONCATENATE(\"ESTABLECIMIENTO/ESTRATEGIA: \",NOMBRE!$B$3,\" - \",\"( \",NOMBRE!$C$3,NOMBRE!$D$3,NOMBRE!$E$3,NOMBRE!$F$3,NOMBRE!$G$3,NOMBRE!$H$3,\" )\")","v":"ESTABLECIMIENTO/ESTRATEGIA:  - (  )"}]
[{"$f":"CONCATENATE(\"MES: \",NOMBRE!$B$6,\" - \",\"( \",NOMBRE!$C$6,NOMBRE!$D$6,\" )\")","v":"MES:  - (  )"}]
[{"$f":"CONCATENATE(\"AÑO: \",NOMBRE!$B$7)","v":"AÑO: 2024"}]
["REM-P2. POBLACIÓN EN CONTROL PROGRAMA NACIONAL  DE SALUD DE LA INFANCIA "]
["SECCION A: POBLACIÓN EN CONTROL, SEGÚN ESTADO NUTRICIONAL PARA NIÑOS MENOR DE UN MES- 59 MESES"]
["INDICADOR NUTRICIONAL\nY\nPARÁMETROS DE MEDICIÓN",null,"TOTAL",null,null,"GRUPOS DE EDAD (en meses) Y SEXO",null,null,null,null,null,null,null,null,null,null,null,null,null,null,null,null,null,null,null,null,null,null,null,null,null,null,null,"Pueblos Originarios",null," Migrantes"]
[null,null,null,null,null,"Menor de 1 mes",null,"1 mes",null,"2 meses",null,"3 meses",null,"4 meses",null,"5 meses",null,"6 meses",null,"7 a 11 meses",null,"12 a 17 meses",null,"18 a 23 meses",null,"24 a 35 meses",null,"36 a 41 meses",null,"42 a 47 meses",null,"48 a 59 meses"]
[null,null,"Ambos sexos","Hombres","Mujeres","Hombres","Mujeres","Hombres","Mujeres","Hombres","Mujeres","Hombres","Mujeres","Hombres","Mujeres","Hombres","Mujeres","Hombres","Mujeres","Hombres","Mujeres","Hombres","Mujeres","Hombres","Mujeres","Hombres","Mujeres","Hombres","Mujeres","Hombres","Mujeres","Hombres","Mujeres","Hombres","Mujeres","Hombres","Mujeres"]
["TOTAL DE NIÑOS/AS EN CONTROL",null,{"$f":"SUM(D11:E11)","v":0},{"$f":"+F11+H11+J11+L11+N11+P11+R11+T11+V11+X11+Z11+AB11+AD11+AF11","v":0},{"$f":"+G11+I11+K11+M11+O11+Q11+S11+U11+W11+Y11+AA11+AC11+AE11+AG11","v":0},null,null,null,null,null,null,null,null,null,null,null,null,null,null,null,null,null,null,null,null,null,null,null,null,null,null,null,null,null,null,null,null,{"$f":"($CD11&CE11&CF11&CG11&CH11&CI11&CJ11&CK11&CL11&CM11&CN11&CO11&CP11&CQ11&CR11&CS11&CT11&CU11&CV11&CW11&CX11&CY11&CZ11)","v":""},null,null,null,null,null,null,null,null,null,null,null,null,null,null,null,null,null,null,null,null,null,null,null,null,null,null,null,null,null,null,null,null,null,null,null,null,null,null,null,null,null,null,null,{"$f":"IF(H11+I11<>H38+I38,\"* El Total de niños (as) en Control de 1 mes debe ser igual al Total de niños (as) según Diagnóstico Nutricional Integrado. \",\"\")","v":""},{"$f":"IF(J11+K11<>J38+K38,\"* El Total de niños (as) en Control de 2 meses debe ser igual al Total de niños (as) según Diagnóstico Nutricional Integrado. \",\"\")","v":""},{"$f":"IF(L11+M11<>L38+M38,\"* El Total de niños (as) en Control de 3 meses debe ser igual al Total de niños (as) según Diagnóstico Nutricional Integrado. \",\"\")","v":""},{"$f":"IF(N11+O11<>N38+O38,\"* El Total de niños (as) en Control de 4 meses debe ser igual al Total de niños (as) según Diagnóstico Nutricional Integrado. \",\"\")","v":""},{"$f":"IF(P11+Q11<>P38+Q38,\"* El Total de niños (as) en Control de 5 meses debe ser igual al Total de niños (as) según Diagnóstico Nutricional Integrado. \",\"\")","v":""},{"$f":"IF($R$11+$S$11<>$R$38+$S$38,\"* El Total de niños (as) en Control de 6 meses debe ser igual al Total de niños (as) según Diagnóstico Nutricional Integrado. \",\"\")","v":""},{"$f":"IF($T$11+$U$11<>$T$38+$U$38,\"* El Total de niños (as) en Control de 7 a 11 meses debe ser igual al Total de niños (as) según Diagnóstico Nutricional Integrado. \",\"\")","v":""},{"$f":"IF($V$11+$W$11<>$V$38+$W$38,\"* El Total de niños (as) en Control de 12 a 17 meses debe ser igual al Total de niños (as) según Diagnóstico Nutricional Integrado. \",\"\")","v":""},{"$f":"IF($X$11+$Y$11<>$X$38+$Y$38,\"* El Total de niños (as) en Control de 18 a 23 meses debe ser igual al Total de niños (as) según Diagnóstico Nutricional Integrado. \",\"\")","v":""},{"$f":"IF($Z$11+$AA$11<>$Z$38+$AA$38,\"* El Total de niños (as) en Control de 24 a 35 meses debe ser igual al Total de niños (as) según Diagnóstico Nutricional Integrado. \",\"\")","v":""},{"$f":"IF($AB$11+$AC$11<>$AB$38+$AC$38,\"* El Total de niños (as) en Control de 36 a 41 meses debe ser igual al Total de niños (as) según Diagnóstico Nutricional Integrado. \",\"\")","v":""},{"$f":"IF($AD$11+$AE$11<>$AD$38+$AE$38,\"* El Total de niños (as) en Control de 42 a 47 meses debe ser igual al Total de niños (as) según Diagnóstico Nutricional Integrado. \",\"\")","v":""},{"$f":"IF($AF$11+$AG$11<>$AF$38+$AG$38,\"* El Total de niños (as) en Control de 48 a 59 meses debe ser igual al Total de niños (as) según Diagnóstico Nutricional Integrado. \",\"\")","v":""},{"$f":"IF($C11>=$AH11+$AI11,\"\",\"* El Total de Pueblos Originarios no debe ser mayor al Total de niños (as) en control. \")","v":""},{"$f":"IF($C11>=$AJ11+$AK11,\"\",\"* El Total de Población Migrantes no debe ser mayor al Total de niños (as) en control. \")","v":""},{"$f":"IF($AH$11+$AI$11<>$AH$38+$AI$38,\"* El Total de niños (as) en Control de Pueblos Originarios debe ser igual al Total de niños (as) según Diagnóstico Nutricional Integrado. \",\"\")","v":""},{"$f":"IF($AJ$11+$AK$11<>$AJ$38+$AK$38,\"* El Total de niños (as) en Control de Población Migrantes debe ser igual al Total de niños (as) según Diagnóstico Nutricional Integrado. \",\"\")","v":""},{"$f":"IF(AND(D11>0,OR(AH11=\"\")),\" * No olvide digitar la variable Pueblos Originarios Hombres (Digite Cero si no tiene).\",IF(AH11>D11,\" * La variable Pueblos Originarios Hombres no puede ser Mayor al Total Hombres.\",\"\"))","v":""},{"$f":"IF(AND(E11>0,OR(AI11=\"\")),\" * No olvide digitar la variable Pueblos Originarios Mujeres (Digite Cero si no tiene).\",IF(AI11>E11,\" * La variable Pueblos Originarios Mujeres no puede ser Mayor al Total Mujeres.\",\"\"))","v":""},{"$f":"IF(AND(D11>0,OR(AJ11=\"\")),\" * No olvide digitar la variable Migrantes Hombres (Digite Cero si no tiene).\",IF(AJ11>D11,\" * La variable Migrantes Hombres no puede ser Mayor al Total.\",\"\"))","v":""},{"$f":"IF(AND(E11>0,OR(AK11=\"\")),\" * No olvide digitar la variable Migrantes Mujeres (Digite Cero si no tiene).\",IF(AK11>E11,\" * La variable Migrantes Mujeres no puede ser Mayor al Total.\",\"\"))","v":""},{"$f":"IF($AH$11+$AI$11<>$AH$38+$AI$38,\"* El Total de niños (as) en Control de Población Migrantes debe ser igual al Total de niños (as) según Diagnóstico Nutricional Integrado. \",\"\")","v":""},{"$f":"IF($AJ$11+$AK$11<>$AJ$38+$AK$38,\"* El Total de niños (as) en Control de Población Migrantes debe ser igual al Total de niños (as) según Diagnóstico Nutricional Integrado. \",\"\")","v":""},null,null,null,{"$f":"IF($H$11+$I$11<>$H$38+$I$38,1,0)","v":0},{"$f":"IF($J$11+$K$11<>$J$38+$K$38,1,0)","v":0},{"$f":"IF($L$11+$M$11<>$L$38+$M$38,1,0)","v":0},{"$f":"IF($N$11+$O$11<>$N$38+$O$38,1,0)","v":0},{"$f":"IF($P$11+$Q$11<>$P$38+$Q$38,1,0)","v":0},{"$f":"IF($R$11+$S$11<>$R$38+$S$38,1,0)","v":0},{"$f":"IF($T$11+$U$11<>$T$38+$U$38,1,0)","v":0},{"$f":"IF($V$11+$W$11<>$V$38+$W$38,1,0)","v":0},{"$f":"IF($X$11+$Y$11<>$X$38+$Y$38,1,0)","v":0},{"$f":"IF($Z$11+$AA$11<>$Z$38+$AA$38,1,0)","v":0},{"$f":"IF($AB$11+$AC$11<>$AB$38+$AC$38,1,0)","v":0},{"$f":"IF($AD$11+$AE$11<>$AD$38+$AE$38,1,0)","v":0},{"$f":"IF($AF$11+$AG$11<>$AF$38+$AG$38,1,0)","v":0},{"$f":"IF(AND(D11>0,OR(AH11=\"\")),1,IF(AH11>D11,1,0))","v":0},{"$f":"IF(AND(E11>0,OR(AI11=\"\")),1,IF(AI11>E11,1,0))","v":0},{"$f":"IF(AND(D11>0,OR(AJ11=\"\")),1,IF(AJ11>D11,1,0))","v":0},{"$f":"IF(AND(E11>0,OR(AK11=\"\")),1,IF(AK11>E11,1,0))","v":0},{"$f":"IF($AH$11+$AI$11<>$AH$38+$AI$38,1,0)","v":0},{"$f":"IF($AJ$11+$AK$11<>$AJ$38+$AK$38,1,0)","v":0}]
["INDICADOR PESO/EDAD","+ 2 D.S. (>= +2.0)",{"$f":"SUM(D12:E12)","v":0},{"$f":"+F12+H12+J12+L12+N12+P12+R12+T12+V12+X12+Z12+AB12+AD12+AF12","v":0},{"$f":"+G12+I12+K12+M12+O12+Q12+S12+U12+W12+Y12+AA12+AC12+AE12+AG12","v":0},null,null,null,null,null,null,null,null,null,null,null,null,null,null,null,null,null,null,null,null,null,null,null,null,null,null,null,null,null,null,null,null,{"$f":"($CU12&CV12&CW12&CX12)","v":""},null,null,null,null,null,null,null,null,null,null,null,null,null,null,null,null,null,null,null,null,null,null,null,null,null,null,null,null,null,null,null,null,null,null,null,null,null,null,null,null,null,null,null,null,null,null,null,null,null,null,null,null,null,null,null,null,null,null,null,null,{"$f":"IF(AND(D12>0,OR(AH12=\"\")),\" * No olvide digitar la variable Pueblos Originarios Hombres (Digite Cero si no tiene).\",IF(AH12>D12,\" * La variable Pueblos Originarios Hombres no puede ser Mayor al Total Hombres.\",\"\"))","v":""},{"$f":"IF(AND(E12>0,OR(AI12=\"\")),\" * No olvide digitar la variable Pueblos Originarios Mujeres (Digite Cero si no tiene).\",IF(AI12>E12,\" * La variable Pueblos Originarios Mujeres no puede ser Mayor al Total Mujeres.\",\"\"))","v":""},{"$f":"IF(AND(D12>0,OR(AJ12=\"\")),\" * No olvide digitar la variable Migrantes Hombres (Digite Cero si no tiene).\",IF(AJ12>D12,\" * La variable Migrantes Hombres no puede ser Mayor al Total.\",\"\"))","v":""},{"$f":"IF(AND(E12>0,OR(AK12=\"\")),\" * No olvide digitar la variable Migrantes Mujeres (Digite Cero si no tiene).\",IF(AK12>E12,\" * La variable Migrantes Mujeres no puede ser Mayor al Total.\",\"\"))","v":""},null,null,null,null,null,null,null,null,null,null,null,null,null,null,null,null,null,null,{"$f":"IF(AND(D12>0,OR(AH12=\"\")),1,IF(AH12>D12,1,0))","v":0},{"$f":"IF(AND(E12>0,OR(AI12=\"\")),1,IF(AI12>E12,1,0))","v":0},{"$f":"IF(AND(D12>0,OR(AJ12=\"\")),1,IF(AJ12>D12,1,0))","v":0},{"$f":"IF(AND(E12>0,OR(AK12=\"\")),1,IF(AK12>E12,1,0))","v":0}]
[null,"+ 1 D.S. (+1.0 a +1.9)",0,0,0,null,null,null,null,null,null,null,null,null,null,null,null,null,null,null,null,null,null,null,null,null,null,null,null,null,null,null,null,null,null,null,null,{"$f":"($CU13&CV13&CW13&CX13)","v":""},null,null,null,null,null,null,null,null,null,null,null,null,null,null,null,null,null,null,null,null,null,null,null,null,null,null,null,null,null,null,null,null,null,null,null,null,null,null,null,null,null,null,null,null,null,null,null,null,null,null,null,null,null,null,null,null,null,null,null,null,"","","","",null,null,null,null,null,null,null,null,null,null,null,null,null,null,null,null,null,null,0,0,0,0]
[null,"TOTAL",0,0,0,{"$f":"+SUM(F12:F13)","v":0},{"$f":"+SUM(G12:G13)","v":0},{"$f":"+SUM(H12:H13)","v":0},{"$f":"+SUM(I12:I13)","v":0},0,0,0,0,0,0,0,0,0,0,0,{"$f":"+SUM(U12:U13)","v":0},{"$f":"SUM(V12:V13)","v":0},{"$f":"SUM(W12:W13)","v":0},{"$f":"SUM(X12:X13)","v":0},0,0,0,0,0,0,0,{"$f":"SUM(AF12:AF13)","v":0},0,{"$f":"+SUM(AH12:AH13)","v":0},{"$f":"+SUM(AI12:AI13)","v":0},{"$f":"+SUM(AJ12:AJ13)","v":0},{"$f":"+SUM(AK12:AK13)","v":0},{"$f":"($CD14&CE14)","v":""}]
[null,"- 1 D.S. (-1.0 a -1.9)",0,0,0,null,null,null,null,null,null,null,null,null,null,null,null,null,null,null,null,null,null,null,null,null,null,null,null,null,null,null,null,null,null,null,null,{"$f":"($CU15&CV15&CW15&CX15)","v":""},null,null,null,null,null,null,null,null,null,null,null,null,null,null,null,null,null,null,null,null,null,null,null,null,null,null,null,null,null,null,null,null,null,null,null,null,null,null,null,null,null,null,null,null,null,null,null,null,null,null,null,null,null,null,null,null,null,null,null,null,"",{"$f":"IF(AND(E15>0,OR(AI15=\"\")),\" * No olvide digitar la variable Pueblos Originarios Mujeres (Digite Cero si no tiene).\",IF(AI15>E15,\" * La variable Pueblos Originarios Mujeres no puede ser Mayor al Total Mujeres.\",\"\"))","v":""},{"$f":"IF(AND(D15>0,OR(AJ15=\"\")),\" * No olvide digitar la variable Migrantes Hombres (Digite Cero si no tiene).\",IF(AJ15>D15,\" * La variable Migrantes Hombres no puede ser Mayor al Total.\",\"\"))","v":""},{"$f":"IF(AND(E15>0,OR(AK15=\"\")),\" * No olvide digitar la variable Migrantes Mujeres (Digite Cero si no tiene).\",IF(AK15>E15,\" * La variable Migrantes Mujeres no puede ser Mayor al Total.\",\"\"))","v":""},null,null,null,null,null,null,null,null,null,null,null,null,null,null,null,null,null,null,{"$f":"IF(AND(D15>0,OR(AH15=\"\")),1,IF(AH15>D15,1,0))","v":0},{"$f":"IF(AND(E15>0,OR(AI15=\"\")),1,IF(AI15>E15,1,0))","v":0},{"$f":"IF(AND(D15>0,OR(AJ15=\"\")),1,IF(AJ15>D15,1,0))","v":0},{"$f":"IF(AND(E15>0,OR(AK15=\"\")),1,IF(AK15>E15,1,0))","v":0}]
[null,"- 2 D.S. (<= -2.0)",0,0,0,null,null,null,null,null,null,null,null,null,null,null,null,null,null,null,null,null,null,null,null,null,null,null,null,null,null,null,null,null,null,null,null,{"$f":"($CU16&CV16&CW16&CX16)","v":""},null,null,null,null,null,null,null,null,null,null,null,null,null,null,null,null,null,null,null,null,null,null,null,null,null,null,null,null,null,null,null,null,null,null,null,null,null,null,null,null,null,null,null,null,null,null,null,null,null,null,null,null,null,null,null,null,null,null,null,null,"","","","",null,null,null,null,null,null,null,null,null,null,null,null,null,null,null,null,null,null,0,0,0,0]
[null,"TOTAL",0,0,0,{"$f":"+SUM(F15:F16)","v":0},0,{"$f":"SUM(H15:H16)","v":0},{"$f":"SUM(I15:I16)","v":0},0,0,0,0,0,0,0,0,0,0,0,0,{"$f":"SUM(V15:V16)","v":0},{"$f":"SUM(W15:W16)","v":0},0,0,0,0,0,0,0,0,0,0,{"$f":"SUM(AH15:AH16)","v":0},{"$f":"SUM(AI15:AI16)","v":0},{"$f":"SUM(AJ15:AJ16)","v":0},{"$f":"SUM(AK15:AK16)","v":0},{"$f":"($CD17&CE17)","v":""}]
["INDICADOR PESO/TALLA","+ 2 D.S. (>= +2.0)",0,0,0,null,null,null,null,null,null,null,null,null,null,null,null,null,null,null,null,null,null,null,null,null,null,null,null,null,null,null,null,null,null,null,null,{"$f":"($CU18&CV18&CW18&CX18)","v":""},null,null,null,null,null,null,null,null,null,null,null,null,null,null,null,null,null,null,null,null,null,null,null,null,null,null,null,null,null,null,null,null,null,null,null,null,null,null,null,null,null,null,null,null,null,null,null,null,null,null,null,null,null,null,null,null,null,null,null,null,"",{"$f":"IF(AND(E18>0,OR(AI18=\"\")),\" * No olvide digitar la variable Pueblos Originarios Mujeres (Digite Cero si no tiene).\",IF(AI18>E18,\" * La variable Pueblos Originarios Mujeres no puede ser Mayor al Total Mujeres.\",\"\"))","v":""},{"$f":"IF(AND(D18>0,OR(AJ18=\"\")),\" * No olvide digitar la variable Migrantes Hombres (Digite Cero si no tiene).\",IF(AJ18>D18,\" * La variable Migrantes Hombres no puede ser Mayor al Total.\",\"\"))","v":""},{"$f":"IF(AND(E18>0,OR(AK18=\"\")),\" * No olvide digitar la variable Migrantes Mujeres (Digite Cero si no tiene).\",IF(AK18>E18,\" * La variable Migrantes Mujeres no puede ser Mayor al Total.\",\"\"))","v":""},null,null,null,null,null,null,null,null,null,null,null,null,null,null,null,null,null,null,{"$f":"IF(AND(D18>0,OR(AH18=\"\")),1,IF(AH18>D18,1,0))","v":0},{"$f":"IF(AND(E18>0,OR(AI18=\"\")),1,IF(AI18>E18,1,0))","v":0},{"$f":"IF(AND(D18>0,OR(AJ18=\"\")),1,IF(AJ18>D18,1,0))","v":0},{"$f":"IF(AND(E18>0,OR(AK18=\"\")),1,IF(AK18>E18,1,0))","v":0}]
[null,"+ 1 D.S. (+1.0 a +1.9)",0,0,0,null,null,null,null,null,null,null,null,null,null,null,null,null,null,null,null,null,null,null,null,null,null,null,null,null,null,null,null,null,null,null,null,{"$f":"($CU19&CV19&CW19&CX19)","v":""},null,null,null,null,null,null,null,null,null,null,null,null,null,null,null,null,null,null,null,null,null,null,null,null,null,null,null,null,null,null,null,null,null,null,null,null,null,null,null,null,null,null,null,null,null,null,null,null,null,null,null,null,null,null,null,null,null,null,null,null,"","","","",null,null,null,null,null,null,null,null,null,null,null,null,null,null,null,null,null,null,0,0,0,0]
[null,"TOTAL",0,0,0,{"$f":"SUM(F18:F19)","v":0},{"$f":"SUM(G18:G19)","v":0},{"$f":"+SUM(H18:H19)","v":0},{"$f":"+SUM(I18:I19)","v":0},{"$f":"+SUM(J18:J19)","v":0},0,0,0,0,0,0,0,0,0,0,0,0,0,0,0,0,0,0,0,0,0,0,0,0,0,0,0,{"$f":"($CD20&CE20)","v":""}]
[null,"- 1 D.S. (-1.0 a -1.9)",0,0,0,null,null,null,null,null,null,null,null,null,null,null,null,null,null,null,null,null,null,null,null,null,null,null,null,null,null,null,null,null,null,null,null,{"$f":"($CU21&CV21&CW21&CX21)","v":""},null,null,null,null,null,null,null,null,null,null,null,null,null,null,null,null,null,null,null,null,null,null,null,null,null,null,null,null,null,null,null,null,null,null,null,null,null,null,null,null,null,null,null,null,null,null,null,null,null,null,null,null,null,null,null,null,null,null,null,null,"",{"$f":"IF(AND(E21>0,OR(AI21=\"\")),\" * No olvide digitar la variable Pueblos Originarios Mujeres (Digite Cero si no tiene).\",IF(AI21>E21,\" * La variable Pueblos Originarios Mujeres no puede ser Mayor al Total Mujeres.\",\"\"))","v":""},{"$f":"IF(AND(D21>0,OR(AJ21=\"\")),\" * No olvide digitar la variable Migrantes Hombres (Digite Cero si no tiene).\",IF(AJ21>D21,\" * La variable Migrantes Hombres no puede ser Mayor al Total.\",\"\"))","v":""},{"$f":"IF(AND(E21>0,OR(AK21=\"\")),\" * No olvide digitar la variable Migrantes Mujeres (Digite Cero si no tiene).\",IF(AK21>E21,\" * La variable Migrantes Mujeres no puede ser Mayor al Total.\",\"\"))","v":""},null,null,null,null,null,null,null,null,null,null,null,null,null,null,null,null,null,null,{"$f":"IF(AND(D21>0,OR(AH21=\"\")),1,IF(AH21>D21,1,0))","v":0},{"$f":"IF(AND(E21>0,OR(AI21=\"\")),1,IF(AI21>E21,1,0))","v":0},{"$f":"IF(AND(D21>0,OR(AJ21=\"\")),1,IF(AJ21>D21,1,0))","v":0},{"$f":"IF(AND(E21>0,OR(AK21=\"\")),1,IF(AK21>E21,1,0))","v":0}]
[null,"- 2 D.S. (<= -2.0)",0,0,0,null,null,null,null,null,null,null,null,null,null,null,null,null,null,null,null,null,null,null,null,null,null,null,null,null,null,null,null,null,null,null,null,{"$f":"($CU22&CV22&CW22&CX22)","v":""},null,null,null,null,null,null,null,null,null,null,null,null,null,null,null,null,null,null,null,null,null,null,null,null,null,null,null,null,null,null,null,null,null,null,null,null,null,null,null,null,null,null,null,null,null,null,null,null,null,null,null,null,null,null,null,null,null,null,null,null,"","","","",null,null,null,null,null,null,null,null,null,null,null,null,null,null,null,null,null,null,0,0,0,0]
[null,"TOTAL",0,0,0,{"$f":"SUM(F21:F22)","v":0},0,{"$f":"SUM(H21:H22)","v":0},{"$f":"SUM(I21:I22)","v":0},{"$f":"SUM(J21:J22)","v":0},0,0,0,0,0,0,0,0,0,0,0,0,0,0,0,0,0,0,0,0,0,0,0,0,0,0,{"$f":"SUM(AK21:AK22)","v":0},{"$f":"($CD23&CE23)","v":""}]
["INDICADOR TALLA/EDAD","+ 2 D.S. (>= +2.0)",0,0,0,null,null,null,null,null,null,null,null,null,null,null,null,null,null,null,null,null,null,null,null,null,null,null,null,null,null,null,null,null,null,null,null,{"$f":"($CU24&CV24&CW24&CX24)","v":""},null,null,null,null,null,null,null,null,null,null,null,null,null,null,null,null,null,null,null,null,null,null,null,null,null,null,null,null,null,null,null,null,null,null,null,null,null,null,null,null,null,null,null,null,null,null,null,null,null,null,null,null,null,null,null,null,null,null,null,null,"",{"$f":"IF(AND(E24>0,OR(AI24=\"\")),\" * No olvide digitar la variable Pueblos Originarios Mujeres (Digite Cero si no tiene).\",IF(AI24>E24,\" * La variable Pueblos Originarios Mujeres no puede ser Mayor al Total Mujeres.\",\"\"))","v":""},{"$f":"IF(AND(D24>0,OR(AJ24=\"\")),\" * No olvide digitar la variable Migrantes Hombres (Digite Cero si no tiene).\",IF(AJ24>D24,\" * La variable Migrantes Hombres no puede ser Mayor al Total.\",\"\"))","v":""},{"$f":"IF(AND(E24>0,OR(AK24=\"\")),\" * No olvide digitar la variable Migrantes Mujeres (Digite Cero si no tiene).\",IF(AK24>E24,\" * La variable Migrantes Mujeres no puede ser Mayor al Total.\",\"\"))","v":""},null,null,null,null,null,null,null,null,null,null,null,null,null,null,null,null,null,null,{"$f":"IF(AND(D24>0,OR(AH24=\"\")),1,IF(AH24>D24,1,0))","v":0},{"$f":"IF(AND(E24>0,OR(AI24=\"\")),1,IF(AI24>E24,1,0))","v":0},{"$f":"IF(AND(D24>0,OR(AJ24=\"\")),1,IF(AJ24>D24,1,0))","v":0},{"$f":"IF(AND(E24>0,OR(AK24=\"\")),1,IF(AK24>E24,1,0))","v":0}]
[null,"+ 1 D.S. (+1.0 a +1.9)",0,0,0,null,null,null,null,null,null,null,null,null,null,null,null,null,null,null,null,null,null,null,null,null,null,null,null,null,null,null,null,null,null,null,null,{"$f":"($CU25&CV25&CW25&CX25)","v":""},null,null,null,null,null,null,null,null,null,null,null,null,null,null,null,null,null,null,null,null,null,null,null,null,null,null,null,null,null,null,null,null,null,null,null,null,null,null,null,null,null,null,null,null,null,null,null,null,null,null,null,null,null,null,null,null,null,null,null,null,"","","","",null,null,null,null,null,null,null,null,null,null,null,null,null,null,null,null,null,null,0,0,0,0]
[null,"TOTAL",0,0,0,{"$f":"SUM(F24:F25)","v":0},0,{"$f":"SUM(H24:H25)","v":0},{"$f":"SUM(I24:I25)","v":0},0,0,0,0,0,0,0,0,0,0,0,0,0,0,0,0,0,0,0,0,0,0,0,0,0,0,0,0,{"$f":"($CD26&CE26)","v":""}]
[null,"- 1 D.S. (-1.0 a -1.9)",0,0,0,null,null,null,null,null,null,null,null,null,null,null,null,null,null,null,null,null,null,null,null,null,null,null,null,null,null,null,null,null,null,null,null,{"$f":"($CU27&CV27&CW27&CX27)","v":""},null,null,null,null,null,null,null,null,null,null,null,null,null,null,null,null,null,null,null,null,null,null,null,null,null,null,null,null,null,null,null,null,null,null,null,null,null,null,null,null,null,null,null,null,null,null,null,null,null,null,null,null,null,null,null,null,null,null,null,null,"",{"$f":"IF(AND(E27>0,OR(AI27=\"\")),\" * No olvide digitar la variable Pueblos Originarios Mujeres (Digite Cero si no tiene).\",IF(AI27>E27,\" * La variable Pueblos Originarios Mujeres no puede ser Mayor al Total Mujeres.\",\"\"))","v":""},{"$f":"IF(AND(D27>0,OR(AJ27=\"\")),\" * No olvide digitar la variable Migrantes Hombres (Digite Cero si no tiene).\",IF(AJ27>D27,\" * La variable Migrantes Hombres no puede ser Mayor al Total.\",\"\"))","v":""},{"$f":"IF(AND(E27>0,OR(AK27=\"\")),\" * No olvide digitar la variable Migrantes Mujeres (Digite Cero si no tiene).\",IF(AK27>E27,\" * La variable Migrantes Mujeres no puede ser Mayor al Total.\",\"\"))","v":""},null,null,null,null,null,null,null,null,null,null,null,null,null,null,null,null,null,null,{"$f":"IF(AND(D27>0,OR(AH27=\"\")),1,IF(AH27>D27,1,0))","v":0},{"$f":"IF(AND(E27>0,OR(AI27=\"\")),1,IF(AI27>E27,1,0))","v":0},{"$f":"IF(AND(D27>0,OR(AJ27=\"\")),1,IF(AJ27>D27,1,0))","v":0},{"$f":"IF(AND(E27>0,OR(AK27=\"\")),1,IF(AK27>E27,1,0))","v":0}]
[null,"- 2 D.S. (<= -2.0)",0,0,0,null,null,null,null,null,null,null,null,null,null,null,null,null,null,null,null,null,null,null,null,null,null,null,null,null,null,null,null,null,null,null,null,{"$f":"($CU28&CV28&CW28&CX28)","v":""},null,null,null,null,null,null,null,null,null,null,null,null,null,null,null,null,null,null,null,null,null,null,null,null,null,null,null,null,null,null,null,null,null,null,null,null,null,null,null,null,null,null,null,null,null,null,null,null,null,null,null,null,null,null,null,null,null,null,null,null,"","","","",null,null,null,null,null,null,null,null,null,null,null,null,null,null,null,null,null,null,0,0,0,0]
[null,"TOTAL",{"$f":"SUM(D29:E29)","v":0},0,0,{"$f":"SUM(F27:F28)","v":0},{"$f":"SUM(G27:G28)","v":0},{"$f":"SUM(H27:H28)","v":0},{"$f":"SUM(I27:I28)","v":0},0,0,0,0,0,0,0,0,0,0,0,0,0,0,0,0,0,0,0,0,0,0,0,0,0,0,0,0,{"$f":"($CD29&CE29)","v":""}]
[null,"PROMEDIO (-0,9 A + 0,9)",0,0,0,null,null,null,null,null,null,null,null,null,null,null,null,null,null,null,null,null,null,null,null,null,null,null,null,null,null,null,null,null,null,null,null,{"$f":"($CU30&CV30&CW30&CX30)","v":""},null,null,null,null,null,null,null,null,null,null,null,null,null,null,null,null,null,null,null,null,null,null,null,null,null,null,null,null,null,null,null,null,null,null,null,null,null,null,null,null,null,null,null,null,null,null,null,null,null,null,null,null,null,null,null,null,null,null,null,null,"",{"$f":"IF(AND(E30>0,OR(AI30=\"\")),\" * No olvide digitar la variable Pueblos Originarios Mujeres (Digite Cero si no tiene).\",IF(AI30>E30,\" * La variable Pueblos Originarios Mujeres no puede ser Mayor al Total Mujeres.\",\"\"))","v":""},{"$f":"IF(AND(D30>0,OR(AJ30=\"\")),\" * No olvide digitar la variable Migrantes Hombres (Digite Cero si no tiene).\",IF(AJ30>D30,\" * La variable Migrantes Hombres no puede ser Mayor al Total.\",\"\"))","v":""},{"$f":"IF(AND(E30>0,OR(AK30=\"\")),\" * No olvide digitar la variable Migrantes Mujeres (Digite Cero si no tiene).\",IF(AK30>E30,\" * La variable Migrantes Mujeres no puede ser Mayor al Total.\",\"\"))","v":""},null,null,null,null,null,null,null,null,null,null,null,null,null,null,null,null,null,null,{"$f":"IF(AND(D30>0,OR(AH30=\"\")),1,IF(AH30>D30,1,0))","v":0},{"$f":"IF(AND(E30>0,OR(AI30=\"\")),1,IF(AI30>E30,1,0))","v":0},{"$f":"IF(AND(D30>0,OR(AJ30=\"\")),1,IF(AJ30>D30,1,0))","v":0},{"$f":"IF(AND(E30>0,OR(AK30=\"\")),1,IF(AK30>E30,1,0))","v":0}]
["DIAGNOSTICO NUTRICIONAL INTEGRADO","RIESGO DE DESNUTRIR/ DEFICIT PONDERAL*",0,{"$f":"+H31+J31+L31+N31+P31+R31+T31+V31+X31+Z31+AB31+AD31+AF31","v":0},{"$f":"+I31+K31+M31+O31+Q31+S31+U31+W31+Y31+AA31+AC31+AE31+AG31","v":0},null,null,null,null,null,null,null,null,null,null,null,null,null,null,null,null,null,null,null,null,null,null,null,null,null,null,null,null,null,null,null,null,"",null,null,null,null,null,null,null,null,null,null,null,null,null,null,null,null,null,null,null,null,null,null,null,null,null,null,null,null,null,null,null,null,null,null,null,null,null,null,null,null,null,null,null,null,null,null,null,null,null,null,null,null,null,null,null,null,null,null,null,null,"","","","",null,null,null,null,null,null,null,null,null,null,null,null,null,null,null,null,null,null,0,0,0,0]
[null,"DESNUTRIDO",0,{"$f":"+H32+J32+L32+N32+P32+R32+T32+V32+X32+Z32+AB32+AD32+AF32","v":0},{"$f":"+I32+K32+M32+O32+Q32+S32+U32+W32+Y32+AA32+AC32+AE32+AG32","v":0},null,null,null,null,null,null,null,null,null,null,null,null,null,null,null,null,null,null,null,null,null,null,null,null,null,null,null,null,null,null,null,null,"",null,null,null,null,null,null,null,null,null,null,null,null,null,null,null,null,null,null,null,null,null,null,null,null,null,null,null,null,null,null,null,null,null,null,null,null,null,null,null,null,null,null,null,null,null,null,null,null,null,null,null,null,null,null,null,null,null,null,null,null,"","","","",null,null,null,null,null,null,null,null,null,null,null,null,null,null,null,null,null,null,0,0,0,0]
[null,"SOBREPESO / RIESGO OBESIDAD",0,0,0,null,null,null,null,null,null,null,null,null,null,null,null,null,null,null,null,null,null,null,null,null,null,null,null,null,null,null,null,null,null,null,null,"",null,null,null,null,null,null,null,null,null,null,null,null,null,null,null,null,null,null,null,null,null,null,null,null,null,null,null,null,null,null,null,null,null,null,null,null,null,null,null,null,null,null,null,null,null,null,null,null,null,null,null,null,null,null,null,null,null,null,null,null,"","","","",null,null,null,null,null,null,null,null,null,null,null,null,null,null,null,null,null,null,0,0,0,0]
[null,"OBESO",0,0,0,null,null,null,null,null,null,null,null,null,null,null,null,null,null,null,null,null,null,null,null,null,null,null,null,null,null,null,null,null,null,null,null,"",null,null,null,null,null,null,null,null,null,null,null,null,null,null,null,null,null,null,null,null,null,null,null,null,null,null,null,null,null,null,null,null,null,null,null,null,null,null,null,null,null,null,null,null,null,null,null,null,null,null,null,null,null,null,null,null,null,null,null,null,"","","","",null,null,null,null,null,null,null,null,null,null,null,null,null,null,null,null,null,null,0,0,0,0]
[null,"NORMAL",0,0,0,null,null,null,null,null,null,null,null,null,null,null,null,null,null,null,null,null,null,null,null,null,null,null,null,null,null,null,null,null,null,null,null,"",null,null,null,null,null,null,null,null,null,null,null,null,null,null,null,null,null,null,null,null,null,null,null,null,null,null,null,null,null,null,null,null,null,null,null,null,null,null,null,null,null,null,null,null,null,null,null,null,null,null,null,null,null,null,null,null,null,null,null,null,"","","","",null,null,null,null,null,null,null,null,null,null,null,null,null,null,null,null,null,null,0,0,0,0]
[null,"SUBTOTAL",{"$f":"SUM(D36:E36)","v":0},0,0,null,null,{"$f":"SUM(H31:H35)","v":0},0,0,0,0,0,0,0,0,0,0,0,0,0,0,0,0,0,0,0,0,0,0,0,0,0,0,0,0,0,{"$f":"($CD36&CE36)","v":""}]
[null,"DESNUTRICIÓN \nSECUNDARIA",{"$f":"SUM(D37:E37)","v":0},0,0,null,null,null,null,null,null,null,null,null,null,null,null,null,null,null,null,null,null,null,null,null,null,null,null,null,null,null,null,null,null,null,null,{"$f":"($CU37&CV37&CW37&CX37)","v":""},null,null,null,null,null,null,null,null,null,null,null,null,null,null,null,null,null,null,null,null,null,null,null,null,null,null,null,null,null,null,null,null,null,null,null,null,null,null,null,null,null,null,null,null,null,null,null,null,null,null,null,null,null,null,null,null,null,null,null,null,"",{"$f":"IF(AND(E37>0,OR(AI37=\"\")),\" * No olvide digitar la variable Pueblos Originarios Mujeres (Digite Cero si no tiene).\",IF(AI37>E37,\" * La variable Pueblos Originarios Mujeres no puede ser Mayor al Total Mujeres.\",\"\"))","v":""},{"$f":"IF(AND(D37>0,OR(AJ37=\"\")),\" * No olvide digitar la variable Migrantes Hombres (Digite Cero si no tiene).\",IF(AJ37>D37,\" * La variable Migrantes Hombres no puede ser Mayor al Total.\",\"\"))","v":""},{"$f":"IF(AND(E37>0,OR(AK37=\"\")),\" * No olvide digitar la variable Migrantes Mujeres (Digite Cero si no tiene).\",IF(AK37>E37,\" * La variable Migrantes Mujeres no puede ser Mayor al Total.\",\"\"))","v":""},null,null,null,null,null,null,null,null,null,null,null,null,null,null,null,null,null,null,{"$f":"IF(AND(D37>0,OR(AH37=\"\")),1,IF(AH37>D37,1,0))","v":0},{"$f":"IF(AND(E37>0,OR(AI37=\"\")),1,IF(AI37>E37,1,0))","v":0},{"$f":"IF(AND(D37>0,OR(AJ37=\"\")),1,IF(AJ37>D37,1,0))","v":0},{"$f":"IF(AND(E37>0,OR(AK37=\"\")),1,IF(AK37>E37,1,0))","v":0}]
[null,"TOTAL",0,0,0,null,null,{"$f":"SUM(H31:H35)+H37","v":0},0,0,0,0,0,0,0,0,0,0,0,0,0,0,0,0,0,0,0,0,0,0,0,0,0,0,0,0,0,{"$f":"($CD38&CE38)","v":""}]
["NIÑOS SIN EVALUACIÓN NUTRICIONAL POR CURSO DE VIDA (RECIÉN NACIDOS) O POR CONDICIÓN ESPECIAL DE SALUD",null,{"$f":"SUM(D39:E39)","v":0},{"$f":"+F39+H39+J39+L39+N39+P39+R39+T39+V39+X39+Z39+AB39+AD39+AF39","v":0},{"$f":"+G39+I39+K39+M39+O39+Q39+S39+U39+W39+Y39+AA39+AC39+AE39+AG39","v":0},null,null,null,null,null,null,null,null,null,null,null,null,null,null,null,null,null,null,null,null,null,null,null,null,null,null,null,null,null,null,null,null,{"$f":"($CU39&CV39&CW39&CX39)","v":""},null,null,null,null,null,null,null,null,null,null,null,null,null,null,null,null,null,null,null,null,null,null,null,null,null,null,null,null,null,null,null,null,null,null,null,null,null,null,null,null,null,null,null,null,null,null,null,null,null,null,null,null,null,null,null,null,null,null,null,null,"",{"$f":"IF(AND(E39>0,OR(AI39=\"\")),\" * No olvide digitar la variable Pueblos Originarios Mujeres (Digite Cero si no tiene).\",IF(AI39>E39,\" * La variable Pueblos Originarios Mujeres no puede ser Mayor al Total Mujeres.\",\"\"))","v":""},{"$f":"IF(AND(D39>0,OR(AJ39=\"\")),\" * No olvide digitar la variable Migrantes Hombres (Digite Cero si no tiene).\",IF(AJ39>D39,\" * La variable Migrantes Hombres no puede ser Mayor al Total.\",\"\"))","v":""},{"$f":"IF(AND(E39>0,OR(AK39=\"\")),\" * No olvide digitar la variable Migrantes Mujeres (Digite Cero si no tiene).\",IF(AK39>E39,\" * La variable Migrantes Mujeres no puede ser Mayor al Total.\",\"\"))","v":""},null,null,null,null,null,null,null,null,null,null,null,null,null,null,null,null,null,null,{"$f":"IF(AND(D39>0,OR(AH39=\"\")),1,IF(AH39>D39,1,0))","v":0},{"$f":"IF(AND(E39>0,OR(AI39=\"\")),1,IF(AI39>E39,1,0))","v":0},{"$f":"IF(AND(D39>0,OR(AJ39=\"\")),1,IF(AJ39>D39,1,0))","v":0},{"$f":"IF(AND(E39>0,OR(AK39=\"\")),1,IF(AK39>E39,1,0))","v":0}]
["SECCION A.1: POBLACIÓN EN CONTROL, SEGÚN ESTADO NUTRICIONAL PARA NIÑOS AS DE 60 MESES - 9 AÑOS 11 MESES"]
["INDICADOR NUTRICIONAL\nY\nPARÁMETROS DE MEDICIÓN",null,"TOTAL",null,null,"GRUPOS DE EDAD (en meses - años) Y SEXO"]
[null,null,null,null,null,"60 a 71 meses",null,"6 a 6 años 11 meses",null,"7 a 7 años 11 meses",null,"8 a 8 años 11 meses",null,"9 a 9 años 11 meses",null,"Pueblos Originarios",null," Migrantes"]
[null,null,"Ambos sexos","Hombres","Mujeres","Hombres","Mujeres","Hombres","Mujeres","Hombres","Mujeres","Hombres","Mujeres","Hombres","Mujeres","Hombres","Mujeres","Hombres","Mujeres"]
["TOTAL DE NIÑOS EN CONTROL",null,{"$f":"+D44+E44","v":0},{"$f":"+F44+H44+J44+L44+N44","v":0},{"$f":"+G44+I44+K44+M44+O44","v":0},null,null,null,null,null,null,null,null,null,null,null,null,null,null,{"$f":"CB44 & CC44 & CD44 & CE44 & CF44 & CG44 & CH44& CI44 & CJ44","v":""},null,null,null,null,null,null,null,null,null,null,null,null,null,null,null,null,null,null,null,null,null,null,null,null,null,null,null,null,null,null,null,null,null,null,null,null,null,null,null,null,null,null,null,null,null,null,null,null,null,null,null,null,null,null,null,null,null,null,null,{"$f":"IF(F44+G44<>F72+G72,\"* El Total de niños en control de 60 a 71 meses no debe ser distinto al total del Diagnóstico Nutricional Integrado. \",\"\")","v":""},{"$f":"IF(H44+I44<>H72+I72,\"* El Total de niñas en control de 6 a 6 años 11 meses no debe ser distinto al total del Diagnóstico Nutricional Integrado. \",\"\")","v":""},{"$f":"IF(J44+K44<>J72+K72,\"* El Total de niños en control de 7 a 7 años 11 meses no debe ser distinto al total del Diagnóstico Nutricional Integrado. \",\"\")","v":""},{"$f":"IF(L44+M44<>L72+M72,\"* El Total de niñas en control de 8 a 8 años 11 meses no debe ser distinto al total del Diagnóstico Nutricional Integrado. \",\"\")","v":""},{"$f":"IF(N44+O44<>N72+O72,\"* El Total de niñas en control de 9 a 9 años 11 meses no debe ser distinto al total del Diagnóstico Nutricional Integrado. \",\"\")","v":""},{"$f":"IF(AND(D44>0,OR(P44=\"\")),\" * No olvide digitar la variable Pueblos Originarios Hombres (Digite Cero si no tiene).\",IF(P44>D44,\" * La variable Pueblos Originarios Hombres no puede ser Mayor al Total Hombres.\",\"\"))","v":""},{"$f":"IF(AND(E44>0,OR(Q44=\"\")),\" * No olvide digitar la variable Pueblos Originarios Mujeres (Digite Cero si no tiene).\",IF(Q44>E44,\" * La variable Pueblos Originarios Mujeres no puede ser Mayor al Total Mujeres.\",\"\"))","v":""},{"$f":"IF(AND(D44>0,OR(R44=\"\")),\" * No olvide digitar la variable Migrantes Hombres (Digite Cero si no tiene).\",IF(R44>D44,\" * La variable Migrantes Hombres no puede ser Mayor al Total Hombres.\",\"\"))","v":""},{"$f":"IF(AND(E44>0,OR(S44=\"\")),\" * No olvide digitar la variable Migrantes Mujeres (Digite Cero si no tiene).\",IF(S44>E44,\" * La variable Migrantes Mujeres no puede ser Mayor al Total Mujeres.\",\"\"))","v":""},{"$f":"IF($P$44+$Q$44<>$P$72+$Q$72,\"* El Total de niños (as) en Control de Población Migrantes debe ser igual al Total de niños (as) según Diagnóstico Nutricional Integrado. \",\"\")","v":""},{"$f":"IF($R$44+$S$44<>$R$72+$S$72,\"* El Total de niños (as) en Control de Población Migrantes debe ser igual al Total de niños (as) según Diagnóstico Nutricional Integrado. \",\"\")","v":""},null,null,null,null,null,null,null,null,null,null,null,null,null,null,null,null,null,{"$f":"IF(F44+G44<>F72+G72,1,0)","v":0},{"$f":"IF(H44+I44<>H72+I72,1,0)","v":0},{"$f":"IF(J44+K44<>J72+K72,1,0)","v":0},{"$f":"IF(L44+M44<>L72+M72,1,0)","v":0},{"$f":"IF(N44+O44<>N72+O72,1,0)","v":0},{"$f":"IF(AND(D44>0,OR(P44=\"\")),1,IF(P44>D44,1,0))","v":0},{"$f":"IF(AND(E44>0,OR(Q44=\"\")),1,IF(Q44>E44,1,0))","v":0},{"$f":"IF(AND(D44>0,OR(R44=\"\")),1,IF(R44>D44,1,0))","v":0},{"$f":"IF(AND(E44>0,OR(S44=\"\")),1,IF(S44>E44,1,0))","v":0},{"$f":"IF($P$44+$Q$44<>$P$72+$Q$72,1,0)","v":0},{"$f":"IF($R$44+$S$44<>$R$72+$S$72,1,0)","v":0}]
["INDICADOR IMC / EDAD","+ 3 D.S. (>= 3 )",{"$f":"+D45+E45","v":0},{"$f":"+F45+H45+J45+L45+N45","v":0},{"$f":"+G45+I45+K45+M45+O45","v":0},null,null,null,null,null,null,null,null,null,null,null,null,null,null,{"$f":"CB45 & CC45 & CD45 & CE45 & CF45 & CG45 & CH45& CI45 & CJ45","v":""},null,null,null,null,null,null,null,null,null,null,null,null,null,null,null,null,null,null,null,null,null,null,null,null,null,null,null,null,null,null,null,null,null,null,null,null,null,null,null,null,null,null,null,null,null,null,null,null,null,null,null,null,null,null,null,null,null,null,null,null,null,null,null,null,{"$f":"IF(AND(D45>0,OR(P45=\"\")),\" * No olvide digitar la variable Pueblos Originarios Hombres (Digite Cero si no tiene).\",IF(P45>D45,\" * La variable Pueblos Originarios Hombres no puede ser Mayor al Total Hombres.\",\"\"))","v":""},{"$f":"IF(AND(E45>0,OR(Q45=\"\")),\" * No olvide digitar la variable Pueblos Originarios Mujeres (Digite Cero si no tiene).\",IF(Q45>E45,\" * La variable Pueblos Originarios Mujeres no puede ser Mayor al Total Mujeres.\",\"\"))","v":""},{"$f":"IF(AND(D45>0,OR(R45=\"\")),\" * No olvide digitar la variable Migrantes Hombres (Digite Cero si no tiene).\",IF(R45>D45,\" * La variable Migrantes Hombres no puede ser Mayor al Total Hombres.\",\"\"))","v":""},{"$f":"IF(AND(E45>0,OR(S45=\"\")),\" * No olvide digitar la variable Migrantes Mujeres (Digite Cero si no tiene).\",IF(S45>E45,\" * La variable Migrantes Mujeres no puede ser Mayor al Total Mujeres.\",\"\"))","v":""},null,null,null,null,null,null,null,null,null,null,null,null,null,null,null,null,null,null,null,null,null,null,null,null,{"$f":"IF(AND(D45>0,OR(P45=\"\")),1,IF(P45>D45,1,0))","v":0},{"$f":"IF(AND(E45>0,OR(Q45=\"\")),1,IF(Q45>E45,1,0))","v":0},{"$f":"IF(AND(D45>0,OR(R45=\"\")),1,IF(R45>D45,1,0))","v":0},{"$f":"IF(AND(E45>0,OR(S45=\"\")),1,IF(S45>E45,1,0))","v":0}]
[null,"+ 2 D.S. (>= +2.0 a +2.9)",{"$f":"+D46+E46","v":0},0,0,null,null,null,null,null,null,null,null,null,null,null,null,null,null,"",null,null,null,null,null,null,null,null,null,null,null,null,null,null,null,null,null,null,null,null,null,null,null,null,null,null,null,null,null,null,null,null,null,null,null,null,null,null,null,null,null,null,null,null,null,null,null,null,null,null,null,null,null,null,null,null,null,null,null,null,null,null,null,null,"","","","",null,null,null,null,null,null,null,null,null,null,null,null,null,null,null,null,null,null,null,null,null,null,null,null,0,0,0,0]
[null,"+ 1 D.S. (>= +1.0 a +1.9)",0,0,0,null,null,null,null,null,null,null,null,null,null,null,null,null,null,"",null,null,null,null,null,null,null,null,null,null,null,null,null,null,null,null,null,null,null,null,null,null,null,null,null,null,null,null,null,null,null,null,null,null,null,null,null,null,null,null,null,null,null,null,null,null,null,null,null,null,null,null,null,null,null,null,null,null,null,null,null,null,null,null,"","","","",null,null,null,null,null,null,null,null,null,null,null,null,null,null,null,null,null,null,null,null,null,null,null,null,0,0,0,0]
[null,"TOTAL",0,{"$f":"+F48+H48+J48+L48+N48","v":0},{"$f":"+G48+I48+K48+M48+O48","v":0},{"$f":"SUM(F45:F47)","v":0},{"$f":"SUM(G45:G47)","v":0},0,0,0,0,0,0,0,0,{"$f":"SUM(P45:P47)","v":0},0,0,0]
[null,"- 1 D.S. (<= -1.0 a -1.9)",0,{"$f":"+F49+H49+J49+L49+N49","v":0},{"$f":"+G49+I49+K49+M49+O49","v":0},null,null,null,null,null,null,null,null,null,null,null,null,null,null,"",null,null,null,null,null,null,null,null,null,null,null,null,null,null,null,null,null,null,null,null,null,null,null,null,null,null,null,null,null,null,null,null,null,null,null,null,null,null,null,null,null,null,null,null,null,null,null,null,null,null,null,null,null,null,null,null,null,null,null,null,null,null,null,null,{"$f":"IF(AND(D49>0,OR(P49=\"\")),\" * No olvide digitar la variable Pueblos Originarios Hombres (Digite Cero si no tiene).\",IF(P49>D49,\" * La variable Pueblos Originarios Hombres no puede ser Mayor al Total Hombres.\",\"\"))","v":""},{"$f":"IF(AND(E49>0,OR(Q49=\"\")),\" * No olvide digitar la variable Pueblos Originarios Mujeres (Digite Cero si no tiene).\",IF(Q49>E49,\" * La variable Pueblos Originarios Mujeres no puede ser Mayor al Total Mujeres.\",\"\"))","v":""},{"$f":"IF(AND(D49>0,OR(R49=\"\")),\" * No olvide digitar la variable Migrantes Hombres (Digite Cero si no tiene).\",IF(R49>D49,\" * La variable Migrantes Hombres no puede ser Mayor al Total Hombres.\",\"\"))","v":""},{"$f":"IF(AND(E49>0,OR(S49=\"\")),\" * No olvide digitar la variable Migrantes Mujeres (Digite Cero si no tiene).\",IF(S49>E49,\" * La variable Migrantes Mujeres no puede ser Mayor al Total Mujeres.\",\"\"))","v":""},null,null,null,null,null,null,null,null,null,null,null,null,null,null,null,null,null,null,null,null,null,null,null,null,{"$f":"IF(AND(D49>0,OR(P49=\"\")),1,IF(P49>D49,1,0))","v":0},{"$f":"IF(AND(E49>0,OR(Q49=\"\")),1,IF(Q49>E49,1,0))","v":0},{"$f":"IF(AND(D49>0,OR(R49=\"\")),1,IF(R49>D49,1,0))","v":0},{"$f":"IF(AND(E49>0,OR(S49=\"\")),1,IF(S49>E49,1,0))","v":0}]
[null,"- 2 D.S. (<= -2.0)",{"$f":"+D50+E50","v":0},0,0,null,null,null,null,null,null,null,null,null,null,null,null,null,null,"",null,null,null,null,null,null,null,null,null,null,null,null,null,null,null,null,null,null,null,null,null,null,null,null,null,null,null,null,null,null,null,null,null,null,null,null,null,null,null,null,null,null,null,null,null,null,null,null,null,null,null,null,null,null,null,null,null,null,null,null,null,null,null,null,"","","","",null,null,null,null,null,null,null,null,null,null,null,null,null,null,null,null,null,null,null,null,null,null,null,null,0,0,0,0]
[null,"TOTAL",0,{"$f":"+F51+H51+J51+L51+N51","v":0},{"$f":"+G51+I51+K51+M51+O51","v":0},{"$f":"SUM(F49:F50)","v":0},{"$f":"SUM(G49:G50)","v":0},0,0,0,0,0,0,0,0,{"$f":"SUM(P49:P50)","v":0},0,0,0]
[null,"PROMEDIO (-0,9 A + 0,9)",0,{"$f":"+F52+H52+J52+L52+N52","v":0},{"$f":"+G52+I52+K52+M52+O52","v":0},null,null,null,null,null,null,null,null,null,null,null,null,null,null,"",null,null,null,null,null,null,null,null,null,null,null,null,null,null,null,null,null,null,null,null,null,null,null,null,null,null,null,null,null,null,null,null,null,null,null,null,null,null,null,null,null,null,null,null,null,null,null,null,null,null,null,null,null,null,null,null,null,null,null,null,null,null,null,null,{"$f":"IF(AND(D52>0,OR(P52=\"\")),\" * No olvide digitar la variable Pueblos Originarios Hombres (Digite Cero si no tiene).\",IF(P52>D52,\" * La variable Pueblos Originarios Hombres no puede ser Mayor al Total Hombres.\",\"\"))","v":""},{"$f":"IF(AND(E52>0,OR(Q52=\"\")),\" * No olvide digitar la variable Pueblos Originarios Mujeres (Digite Cero si no tiene).\",IF(Q52>E52,\" * La variable Pueblos Originarios Mujeres no puede ser Mayor al Total Mujeres.\",\"\"))","v":""},{"$f":"IF(AND(D52>0,OR(R52=\"\")),\" * No olvide digitar la variable Migrantes Hombres (Digite Cero si no tiene).\",IF(R52>D52,\" * La variable Migrantes Hombres no puede ser Mayor al Total Hombres.\",\"\"))","v":""},{"$f":"IF(AND(E52>0,OR(S52=\"\")),\" * No olvide digitar la variable Migrantes Mujeres (Digite Cero si no tiene).\",IF(S52>E52,\" * La variable Migrantes Mujeres no puede ser Mayor al Total Mujeres.\",\"\"))","v":""},null,null,null,null,null,null,null,null,null,null,null,null,null,null,null,null,null,null,null,null,null,null,null,null,{"$f":"IF(AND(D52>0,OR(P52=\"\")),1,IF(P52>D52,1,0))","v":0},{"$f":"IF(AND(E52>0,OR(Q52=\"\")),1,IF(Q52>E52,1,0))","v":0},{"$f":"IF(AND(D52>0,OR(R52=\"\")),1,IF(R52>D52,1,0))","v":0},{"$f":"IF(AND(E52>0,OR(S52=\"\")),1,IF(S52>E52,1,0))","v":0}]
["INDICADOR TALLA/EDAD","+ 2 D.S. (>= +2.0)",0,{"$f":"+F53+H53+J53+L53+N53","v":0},0,null,null,null,null,null,null,null,null,null,null,null,null,null,null,"",null,null,null,null,null,null,null,null,null,null,null,null,null,null,null,null,null,null,null,null,null,null,null,null,null,null,null,null,null,null,null,null,null,null,null,null,null,null,null,null,null,null,null,null,null,null,null,null,null,null,null,null,null,null,null,null,null,null,null,null,null,null,null,null,"","","","",null,null,null,null,null,null,null,null,null,null,null,null,null,null,null,null,null,null,null,null,null,null,null,null,0,0,0,0]
[null,"+ 1 D.S. (+1.0 a +1.9)",0,0,0,null,null,null,null,null,null,null,null,null,null,null,null,null,null,"",null,null,null,null,null,null,null,null,null,null,null,null,null,null,null,null,null,null,null,null,null,null,null,null,null,null,null,null,null,null,null,null,null,null,null,null,null,null,null,null,null,null,null,null,null,null,null,null,null,null,null,null,null,null,null,null,null,null,null,null,null,null,null,null,"","","","",null,null,null,null,null,null,null,null,null,null,null,null,null,null,null,null,null,null,null,null,null,null,null,null,0,0,0,0]
[null,"TOTAL",0,{"$f":"+F55+H55+J55+L55+N55","v":0},{"$f":"+G55+I55+K55+M55+O55","v":0},{"$f":"SUM(F53:F54)","v":0},{"$f":"SUM(G53:G54)","v":0},{"$f":"SUM(H53:H54)","v":0},0,{"$f":"SUM(J53:J54)","v":0},0,{"$f":"SUM(L53:L54)","v":0},0,0,0,0,0,0,0]
[null,"- 1 D.S. (-1.0 a -1.9)",0,{"$f":"+F56+H56+J56+L56+N56","v":0},{"$f":"+G56+I56+K56+M56+O56","v":0},null,null,null,null,null,null,null,null,null,null,null,null,null,null,"",null,null,null,null,null,null,null,null,null,null,null,null,null,null,null,null,null,null,null,null,null,null,null,null,null,null,null,null,null,null,null,null,null,null,null,null,null,null,null,null,null,null,null,null,null,null,null,null,null,null,null,null,null,null,null,null,null,null,null,null,null,null,null,null,{"$f":"IF(AND(D56>0,OR(P56=\"\")),\" * No olvide digitar la variable Pueblos Originarios Hombres (Digite Cero si no tiene).\",IF(P56>D56,\" * La variable Pueblos Originarios Hombres no puede ser Mayor al Total Hombres.\",\"\"))","v":""},{"$f":"IF(AND(E56>0,OR(Q56=\"\")),\" * No olvide digitar la variable Pueblos Originarios Mujeres (Digite Cero si no tiene).\",IF(Q56>E56,\" * La variable Pueblos Originarios Mujeres no puede ser Mayor al Total Mujeres.\",\"\"))","v":""},{"$f":"IF(AND(D56>0,OR(R56=\"\")),\" * No olvide digitar la variable Migrantes Hombres (Digite Cero si no tiene).\",IF(R56>D56,\" * La variable Migrantes Hombres no puede ser Mayor al Total Hombres.\",\"\"))","v":""},{"$f":"IF(AND(E56>0,OR(S56=\"\")),\" * No olvide digitar la variable Migrantes Mujeres (Digite Cero si no tiene).\",IF(S56>E56,\" * La variable Migrantes Mujeres no puede ser Mayor al Total Mujeres.\",\"\"))","v":""},null,null,null,null,null,null,null,null,null,null,null,null,null,null,null,null,null,null,null,null,null,null,null,null,{"$f":"IF(AND(D56>0,OR(P56=\"\")),1,IF(P56>D56,1,0))","v":0},{"$f":"IF(AND(E56>0,OR(Q56=\"\")),1,IF(Q56>E56,1,0))","v":0},{"$f":"IF(AND(D56>0,OR(R56=\"\")),1,IF(R56>D56,1,0))","v":0},{"$f":"IF(AND(E56>0,OR(S56=\"\")),1,IF(S56>E56,1,0))","v":0}]
[null,"- 2 D.S. (<= -2.0)",0,0,0,null,null,null,null,null,null,null,null,null,null,null,null,null,null,"",null,null,null,null,null,null,null,null,null,null,null,null,null,null,null,null,null,null,null,null,null,null,null,null,null,null,null,null,null,null,null,null,null,null,null,null,null,null,null,null,null,null,null,null,null,null,null,null,null,null,null,null,null,null,null,null,null,null,null,null,null,null,null,null,"","","","",null,null,null,null,null,null,null,null,null,null,null,null,null,null,null,null,null,null,null,null,null,null,null,null,0,0,0,0]
[null,"TOTAL",0,{"$f":"+F58+H58+J58+L58+N58","v":0},{"$f":"+G58+I58+K58+M58+O58","v":0},{"$f":"SUM(F56:F57)","v":0},{"$f":"SUM(G56:G57)","v":0},{"$f":"SUM(H56:H57)","v":0},0,{"$f":"SUM(J56:J57)","v":0},0,{"$f":"SUM(L56:L57)","v":0},0,0,0,{"$f":"SUM(P56:P57)","v":0},0,0,0]
[null,"PROMEDIO (-0,9 A + 0,9)",0,{"$f":"+F59+H59+J59+L59+N59","v":0},{"$f":"+G59+I59+K59+M59+O59","v":0},null,null,null,null,null,null,null,null,null,null,null,null,null,null,"",null,null,null,null,null,null,null,null,null,null,null,null,null,null,null,null,null,null,null,null,null,null,null,null,null,null,null,null,null,null,null,null,null,null,null,null,null,null,null,null,null,null,null,null,null,null,null,null,null,null,null,null,null,null,null,null,null,null,null,null,null,null,null,null,{"$f":"IF(AND(D59>0,OR(P59=\"\")),\" * No olvide digitar la variable Pueblos Originarios Hombres (Digite Cero si no tiene).\",IF(P59>D59,\" * La variable Pueblos Originarios Hombres no puede ser Mayor al Total Hombres.\",\"\"))","v":""},{"$f":"IF(AND(E59>0,OR(Q59=\"\")),\" * No olvide digitar la variable Pueblos Originarios Mujeres (Digite Cero si no tiene).\",IF(Q59>E59,\" * La variable Pueblos Originarios Mujeres no puede ser Mayor al Total Mujeres.\",\"\"))","v":""},{"$f":"IF(AND(D59>0,OR(R59=\"\")),\" * No olvide digitar la variable Migrantes Hombres (Digite Cero si no tiene).\",IF(R59>D59,\" * La variable Migrantes Hombres no puede ser Mayor al Total Hombres.\",\"\"))","v":""},{"$f":"IF(AND(E59>0,OR(S59=\"\")),\" * No olvide digitar la variable Migrantes Mujeres (Digite Cero si no tiene).\",IF(S59>E59,\" * La variable Migrantes Mujeres no puede ser Mayor al Total Mujeres.\",\"\"))","v":""},null,null,null,null,null,null,null,null,null,null,null,null,null,null,null,null,null,null,null,null,null,null,null,null,{"$f":"IF(AND(D59>0,OR(P59=\"\")),1,IF(P59>D59,1,0))","v":0},{"$f":"IF(AND(E59>0,OR(Q59=\"\")),1,IF(Q59>E59,1,0))","v":0},{"$f":"IF(AND(D59>0,OR(R59=\"\")),1,IF(R59>D59,1,0))","v":0},{"$f":"IF(AND(E59>0,OR(S59=\"\")),1,IF(S59>E59,1,0))","v":0}]
["INDICADOR PERIMETRO DE CINTURA / EDAD","NORMAL (<p75)",0,0,0,null,null,null,null,null,null,null,null,null,null,null,null,null,null,"",null,null,null,null,null,null,null,null,null,null,null,null,null,null,null,null,null,null,null,null,null,null,null,null,null,null,null,null,null,null,null,null,null,null,null,null,null,null,null,null,null,null,null,null,null,null,null,null,null,null,null,null,null,null,null,null,null,null,null,null,null,null,null,null,"","","","",null,null,null,null,null,null,null,null,null,null,null,null,null,null,null,null,null,null,null,null,null,null,null,null,0,0,0,0]
[null,"RIESGO DE OBESIDAD ABDOMINAL (75<p<90)",0,0,0,null,null,null,null,null,null,null,null,null,null,null,null,null,null,"",null,null,null,null,null,null,null,null,null,null,null,null,null,null,null,null,null,null,null,null,null,null,null,null,null,null,null,null,null,null,null,null,null,null,null,null,null,null,null,null,null,null,null,null,null,null,null,null,null,null,null,null,null,null,null,null,null,null,null,null,null,null,null,null,"","","","",null,null,null,null,null,null,null,null,null,null,null,null,null,null,null,null,null,null,null,null,null,null,null,null,0,0,0,0]
[null,"OBESIDAD ABDOMINAL (>p90)",0,0,0,null,null,null,null,null,null,null,null,null,null,null,null,null,null,"",null,null,null,null,null,null,null,null,null,null,null,null,null,null,null,null,null,null,null,null,null,null,null,null,null,null,null,null,null,null,null,null,null,null,null,null,null,null,null,null,null,null,null,null,null,null,null,null,null,null,null,null,null,null,null,null,null,null,null,null,null,null,null,null,"","","","",null,null,null,null,null,null,null,null,null,null,null,null,null,null,null,null,null,null,null,null,null,null,null,null,0,0,0,0]
[null,"TOTAL",{"$f":"+D63+E63","v":0},{"$f":"+F63+H63+J63+L63+N63","v":0},{"$f":"+G63+I63+K63+M63+O63","v":0},{"$f":"SUM(F60:F62)","v":0},{"$f":"SUM(G60:G62)","v":0},{"$f":"SUM(H60:H62)","v":0},0,{"$f":"SUM(J60:J62)","v":0},0,{"$f":"SUM(L60:L62)","v":0},0,0,0,{"$f":"SUM(P60:P62)","v":0},0,0,{"$f":"SUM(S60:S62)","v":0}]
["DIAGNOSTICO NUTRICIONAL INTEGRADO","RIESGO DE DESNUTRIR/ DEFICIT PONDERAL*",0,{"$f":"+F64+H64+J64+L64+N64","v":0},{"$f":"+G64+I64+K64+M64+O64","v":0},null,null,null,null,null,null,null,null,null,null,null,null,null,null,"",null,null,null,null,null,null,null,null,null,null,null,null,null,null,null,null,null,null,null,null,null,null,null,null,null,null,null,null,null,null,null,null,null,null,null,null,null,null,null,null,null,null,null,null,null,null,null,null,null,null,null,null,null,null,null,null,null,null,null,null,null,null,null,null,{"$f":"IF(AND(D64>0,OR(P64=\"\")),\" * No olvide digitar la variable Pueblos Originarios Hombres (Digite Cero si no tiene).\",IF(P64>D64,\" * La variable Pueblos Originarios Hombres no puede ser Mayor al Total Hombres.\",\"\"))","v":""},{"$f":"IF(AND(E64>0,OR(Q64=\"\")),\" * No olvide digitar la variable Pueblos Originarios Mujeres (Digite Cero si no tiene).\",IF(Q64>E64,\" * La variable Pueblos Originarios Mujeres no puede ser Mayor al Total Mujeres.\",\"\"))","v":""},{"$f":"IF(AND(D64>0,OR(R64=\"\")),\" * No olvide digitar la variable Migrantes Hombres (Digite Cero si no tiene).\",IF(R64>D64,\" * La variable Migrantes Hombres no puede ser Mayor al Total Hombres.\",\"\"))","v":""},{"$f":"IF(AND(E64>0,OR(S64=\"\")),\" * No olvide digitar la variable Migrantes Mujeres (Digite Cero si no tiene).\",IF(S64>E64,\" * La variable Migrantes Mujeres no puede ser Mayor al Total Mujeres.\",\"\"))","v":""},null,null,null,null,null,null,null,null,null,null,null,null,null,null,null,null,null,null,null,null,null,null,null,null,{"$f":"IF(AND(D64>0,OR(P64=\"\")),1,IF(P64>D64,1,0))","v":0},{"$f":"IF(AND(E64>0,OR(Q64=\"\")),1,IF(Q64>E64,1,0))","v":0},{"$f":"IF(AND(D64>0,OR(R64=\"\")),1,IF(R64>D64,1,0))","v":0},{"$f":"IF(AND(E64>0,OR(S64=\"\")),1,IF(S64>E64,1,0))","v":0}]
[null,"DESNUTRIDO",0,0,0,null,null,null,null,null,null,null,null,null,null,null,null,null,null,"",null,null,null,null,null,null,null,null,null,null,null,null,null,null,null,null,null,null,null,null,null,null,null,null,null,null,null,null,null,null,null,null,null,null,null,null,null,null,null,null,null,null,null,null,null,null,null,null,null,null,null,null,null,null,null,null,null,null,null,null,null,null,null,null,"","","","",null,null,null,null,null,null,null,null,null,null,null,null,null,null,null,null,null,null,null,null,null,null,null,null,0,0,0,0]
[null,"SOBREPESO / RIESGO OBESIDAD",0,0,0,null,null,null,null,null,null,null,null,null,null,null,null,null,null,"",null,null,null,null,null,null,null,null,null,null,null,null,null,null,null,null,null,null,null,null,null,null,null,null,null,null,null,null,null,null,null,null,null,null,null,null,null,null,null,null,null,null,null,null,null,null,null,null,null,null,null,null,null,null,null,null,null,null,null,null,null,null,null,null,"","","","",null,null,null,null,null,null,null,null,null,null,null,null,null,null,null,null,null,null,null,null,null,null,null,null,0,0,0,0]
[null,"OBESO",0,0,0,null,null,null,null,null,null,null,null,null,null,null,null,null,null,"",null,null,null,null,null,null,null,null,null,null,null,null,null,null,null,null,null,null,null,null,null,null,null,null,null,null,null,null,null,null,null,null,null,null,null,null,null,null,null,null,null,null,null,null,null,null,null,null,null,null,null,null,null,null,null,null,null,null,null,null,null,null,null,null,"","","","",null,null,null,null,null,null,null,null,null,null,null,null,null,null,null,null,null,null,null,null,null,null,null,null,0,0,0,0]
[null,"OBESO SEVERO",0,0,0,null,null,null,null,null,null,null,null,null,null,null,null,null,null,"",null,null,null,null,null,null,null,null,null,null,null,null,null,null,null,null,null,null,null,null,null,null,null,null,null,null,null,null,null,null,null,null,null,null,null,null,null,null,null,null,null,null,null,null,null,null,null,null,null,null,null,null,null,null,null,null,null,null,null,null,null,null,null,null,"","","","",null,null,null,null,null,null,null,null,null,null,null,null,null,null,null,null,null,null,null,null,null,null,null,null,0,0,0,0]
[null,"NORMAL",0,0,{"$f":"+G69+I69+K69+M69+O69","v":0},null,null,null,null,null,null,null,null,null,null,null,null,null,null,"",null,null,null,null,null,null,null,null,null,null,null,null,null,null,null,null,null,null,null,null,null,null,null,null,null,null,null,null,null,null,null,null,null,null,null,null,null,null,null,null,null,null,null,null,null,null,null,null,null,null,null,null,null,null,null,null,null,null,null,null,null,null,null,null,"","","","",null,null,null,null,null,null,null,null,null,null,null,null,null,null,null,null,null,null,null,null,null,null,null,null,0,0,0,0]
[null,"SUBTOTAL",{"$f":"+D70+E70","v":0},{"$f":"+F70+H70+J70+L70+N70","v":0},{"$f":"+G70+I70+K70+M70+O70","v":0},{"$f":"SUM(F64:F69)","v":0},{"$f":"SUM(G64:G69)","v":0},{"$f":"SUM(H64:H69)","v":0},0,{"$f":"SUM(J64:J69)","v":0},0,{"$f":"SUM(L64:L69)","v":0},0,0,0,0,0,0,0]
[null,"DESNUTRICIÓN \nSECUNDARIA",0,{"$f":"+F71+H71+J71+L71+N71","v":0},{"$f":"+G71+I71+K71+M71+O71","v":0},null,null,null,null,null,null,null,null,null,null,null,null,null,null,"",null,null,null,null,null,null,null,null,null,null,null,null,null,null,null,null,null,null,null,null,null,null,null,null,null,null,null,null,null,null,null,null,null,null,null,null,null,null,null,null,null,null,null,null,null,null,null,null,null,null,null,null,null,null,null,null,null,null,null,null,null,null,null,null,{"$f":"IF(AND(D71>0,OR(P71=\"\")),\" * No olvide digitar la variable Pueblos Originarios Hombres (Digite Cero si no tiene).\",IF(P71>D71,\" * La variable Pueblos Originarios Hombres no puede ser Mayor al Total Hombres.\",\"\"))","v":""},{"$f":"IF(AND(E71>0,OR(Q71=\"\")),\" * No olvide digitar la variable Pueblos Originarios Mujeres (Digite Cero si no tiene).\",IF(Q71>E71,\" * La variable Pueblos Originarios Mujeres no puede ser Mayor al Total Mujeres.\",\"\"))","v":""},{"$f":"IF(AND(D71>0,OR(R71=\"\")),\" * No olvide digitar la variable Migrantes Hombres (Digite Cero si no tiene).\",IF(R71>D71,\" * La variable Migrantes Hombres no puede ser Mayor al Total Hombres.\",\"\"))","v":""},{"$f":"IF(AND(E71>0,OR(S71=\"\")),\" * No olvide digitar la variable Migrantes Mujeres (Digite Cero si no tiene).\",IF(S71>E71,\" * La variable Migrantes Mujeres no puede ser Mayor al Total Mujeres.\",\"\"))","v":""},null,null,null,null,null,null,null,null,null,null,null,null,null,null,null,null,null,null,null,null,null,null,null,null,{"$f":"IF(AND(D71>0,OR(P71=\"\")),1,IF(P71>D71,1,0))","v":0},{"$f":"IF(AND(E71>0,OR(Q71=\"\")),1,IF(Q71>E71,1,0))","v":0},{"$f":"IF(AND(D71>0,OR(R71=\"\")),1,IF(R71>D71,1,0))","v":0},{"$f":"IF(AND(E71>0,OR(S71=\"\")),1,IF(S71>E71,1,0))","v":0}]
[null,"T O T A L",{"$f":"SUM(D72:E72)","v":0},{"$f":"SUM(D64:D69)+D71","v":0},0,0,0,0,0,0,0,0,0,0,0,{"$f":"SUM(P64:P69)+P71","v":0},0,0,0]
["NIÑOS SIN EVALUACIÓN NUTRICIONAL POR CURSO DE VIDA (RECIÉN NACIDOS) O POR CONDICIÓN ESPECIAL DE SALUD",null,{"$f":"SUM(D73:E73)","v":0},{"$f":"+F73+H73+J73+L73+N73","v":0},{"$f":"+G73+I73+K73+M73+O73","v":0},null,null,null,null,null,null,null,null,null,null,null,null,null,null,"",null,null,null,null,null,null,null,null,null,null,null,null,null,null,null,null,null,null,null,null,null,null,null,null,null,null,null,null,null,null,null,null,null,null,null,null,null,null,null,null,null,null,null,null,null,null,null,null,null,null,null,null,null,null,null,null,null,null,null,null,null,null,null,null,{"$f":"IF(AND(D73>0,OR(P73=\"\")),\" * No olvide digitar la variable Pueblos Originarios Hombres (Digite Cero si no tiene).\",IF(P73>D73,\" * La variable Pueblos Originarios Hombres no puede ser Mayor al Total Hombres.\",\"\"))","v":""},{"$f":"IF(AND(E73>0,OR(Q73=\"\")),\" * No olvide digitar la variable Pueblos Originarios Mujeres (Digite Cero si no tiene).\",IF(Q73>E73,\" * La variable Pueblos Originarios Mujeres no puede ser Mayor al Total Mujeres.\",\"\"))","v":""},{"$f":"IF(AND(D73>0,OR(R73=\"\")),\" * No olvide digitar la variable Migrantes Hombres (Digite Cero si no tiene).\",IF(R73>D73,\" * La variable Migrantes Hombres no puede ser Mayor al Total Hombres.\",\"\"))","v":""},{"$f":"IF(AND(E73>0,OR(S73=\"\")),\" * No olvide digitar la variable Migrantes Mujeres (Digite Cero si no tiene).\",IF(S73>E73,\" * La variable Migrantes Mujeres no puede ser Mayor al Total Mujeres.\",\"\"))","v":""},null,null,null,null,null,null,null,null,null,null,null,null,null,null,null,null,null,null,null,null,null,null,null,null,{"$f":"IF(AND(D73>0,OR(P73=\"\")),1,IF(P73>D73,1,0))","v":0},{"$f":"IF(AND(E73>0,OR(Q73=\"\")),1,IF(Q73>E73,1,0))","v":0},{"$f":"IF(AND(D73>0,OR(R73=\"\")),1,IF(R73>D73,1,0))","v":0},{"$f":"IF(AND(E73>0,OR(S73=\"\")),1,IF(S73>E73,1,0))","v":0}]
["NOTA(*): El Diagnóstico Nutricional Integrado de Déficit para los niños (as) 5 años y más denomina Déficit Ponderal al Riesgo de Desnutrir."]
["SECCION B: POBLACION EN CONTROL SEGÚN RESULTADO DE EVALUACIÓN DEL DESARROLLO PSICOMOTOR"]
["RESULTADO Y\nGRUPOS DE EDAD",null,"TOTAL","Hombres","Mujeres","Pueblos Originarios","Migrantes"]
["NORMAL","Menor de 12 meses",{"$f":"SUM(D77:E77)","v":0},null,null,null,null,{"$f":"CF77&CG77&CH77&CI77&CJ77&CK77","v":""},null,null,null,null,null,null,null,null,null,null,null,null,null,null,null,null,null,null,null,null,null,null,null,null,null,null,null,null,null,null,null,null,null,null,null,null,null,null,null,null,null,null,null,null,null,null,null,null,null,null,null,null,null,null,null,null,null,null,null,null,null,null,null,null,null,null,null,null,null,null,null,null,null,null,null,{"$f":"IF(SUM(F11,H11,J11,L11,N11,P11,R11,T11)<SUM(D77,D84,D91,D98),\"* La suma de Población Hombre Menor de 12 meses según resultado de Evaluación no puede ser mayor que la Población Hombres bajo control de la sección A. \",\"\")","v":""},{"$f":"IF(SUM(G11,I11,K11,M11,O11,Q11,S11,U11)<SUM(E77,E84,E91,E98),\"* La suma de Población Mujeres Menor de 12 meses según resultado de Evaluación no puede ser mayor que la Población Mujeres bajo control de la sección A. \",\"\")","v":""},{"$f":"IF(AND(C77>0,OR(F77=\"\")),\" * No olvide digitar la variable Pueblos Originarios (Digite Cero si no tiene).\",IF(F77>C77,\" * La variable Pueblos Originarios no puede ser Mayor al Total.\",\"\"))","v":""},{"$f":"IF(AND(C77>0,OR(G77=\"\")),\" * No olvide digitar la variable Migrantes (Digite Cero si no tiene).\",IF(G77>C77,\" * La variable Migrantes no puede ser Mayor al Total.\",\"\"))","v":""},null,null,null,null,null,null,null,null,null,null,null,null,null,null,null,null,null,null,null,null,{"$f":"IF(SUM(F11,H11,J11,L11,N11,P11,R11,T11)<SUM(D77,D84,D91,D98),1,0)","v":0},{"$f":"IF(SUM(G11,I11,K11,M11,O11,Q11,S11,U11)<SUM(E77,E84,E91,E98),1,0)","v":0},{"$f":"IF(F77>$C77,1,0)","v":0},{"$f":"IF(G77>$C77,1,0)","v":0},{"$f":"IF(AND($C77<>0,F77=\"\"),1,0)","v":0},{"$f":"IF(AND($C77<>0,G77=\"\"),1,0)","v":0}]
[null,"12 a 17 meses",{"$f":"SUM(D78:E78)","v":0},null,null,null,null,{"$f":"CF78&CG78&CH78&CI78&CJ78&CK78","v":""},null,null,null,null,null,null,null,null,null,null,null,null,null,null,null,null,null,null,null,null,null,null,null,null,null,null,null,null,null,null,null,null,null,null,null,null,null,null,null,null,null,null,null,null,null,null,null,null,null,null,null,null,null,null,null,null,null,null,null,null,null,null,null,null,null,null,null,null,null,null,null,null,null,null,null,{"$f":"IF(SUM(V11)<SUM(D78,D85,D92,D99),\"* La suma de Población Hombre de 12 a 17 meses según resultado de Evaluación no puede ser mayor que la Población Hombres bajo control de la sección A. \",\"\")","v":""},{"$f":"IF(SUM(W11)<SUM(E78,E85,E92,E99),\"* La suma de Población Mujer 12 a 17 meses según resultado de Evaluación no puede ser mayor que la Población Mujer bajo control de la sección A. \",\"\")","v":""},{"$f":"IF(AND(C78>0,OR(F78=\"\")),\" * No olvide digitar la variable Pueblos Originarios (Digite Cero si no tiene).\",IF(F78>C78,\" * La variable Pueblos Originarios no puede ser Mayor al Total.\",\"\"))","v":""},{"$f":"IF(AND(C78>0,OR(G78=\"\")),\" * No olvide digitar la variable Migrantes (Digite Cero si no tiene).\",IF(G78>C78,\" * La variable Migrantes no puede ser Mayor al Total.\",\"\"))","v":""},null,null,null,null,null,null,null,null,null,null,null,null,null,null,null,null,null,null,null,null,{"$f":"IF(V$11<SUM(D78,D85,D92,D99),1,0)","v":0},{"$f":"IF(W$11<SUM(E78,E85,E92,E99),1,0)","v":0},{"$f":"IF(F78>$C78,1,0)","v":0},{"$f":"IF(G78>$C78,1,0)","v":0},{"$f":"IF(AND($C78<>0,F78=\"\"),1,0)","v":0},{"$f":"IF(AND($C78<>0,G78=\"\"),1,0)","v":0}]
[null,"18 a 23 meses",0,null,null,null,null,"",null,null,null,null,null,null,null,null,null,null,null,null,null,null,null,null,null,null,null,null,null,null,null,null,null,null,null,null,null,null,null,null,null,null,null,null,null,null,null,null,null,null,null,null,null,null,null,null,null,null,null,null,null,null,null,null,null,null,null,null,null,null,null,null,null,null,null,null,null,null,null,null,null,null,null,{"$f":"IF(SUM(X11)<SUM(D79,D86,D93,D100),\"* La suma de Población Hombre 18 a 23 meses según resultado de Evaluación no puede ser mayor que la Población Hombres bajo control de la sección A. \",\"\")","v":""},{"$f":"IF(SUM(Y11)<SUM(E79,E86,E93,E100),\"* La suma de Población Mujer de 18 a 23 meses según resultado de Evaluación no puede ser mayor que la Población Mujer bajo control de la sección A. \",\"\")","v":""},"","",null,null,null,null,null,null,null,null,null,null,null,null,null,null,null,null,null,null,null,null,{"$f":"IF(X$11<SUM(D79,D86,D93,D100),1,0)","v":0},{"$f":"IF(Y$11<SUM(E79,E86,E93,E100),1,0)","v":0},0,0,0,0]
[null,"24 a 35 meses",0,null,null,null,null,"",null,null,null,null,null,null,null,null,null,null,null,null,null,null,null,null,null,null,null,null,null,null,null,null,null,null,null,null,null,null,null,null,null,null,null,null,null,null,null,null,null,null,null,null,null,null,null,null,null,null,null,null,null,null,null,null,null,null,null,null,null,null,null,null,null,null,null,null,null,null,null,null,null,null,null,{"$f":"IF(SUM(Z11)<SUM(D80,D87,D94,D101),\"* La suma de Población Hombre 24 a 35 meses según resultado de Evaluación no puede ser mayor que la Población Hombres bajo control de la sección A. \",\"\")","v":""},{"$f":"IF(SUM(AA11)<SUM(E80,E87,E94,E101),\"* La suma de Población Hombre 24 a 35 meses según resultado de Evaluación no puede ser mayor que la Población Hombres bajo control de la sección A. \",\"\")","v":""},"","",null,null,null,null,null,null,null,null,null,null,null,null,null,null,null,null,null,null,null,null,{"$f":"IF(Z$11<SUM(D80,D87,D94,D101),1,0)","v":0},{"$f":"IF(AA$11<SUM(E80,E87,E94,E101),1,0)","v":0},0,0,0,0]
[null,"36 a 41 meses",0,null,null,null,null,"",null,null,null,null,null,null,null,null,null,null,null,null,null,null,null,null,null,null,null,null,null,null,null,null,null,null,null,null,null,null,null,null,null,null,null,null,null,null,null,null,null,null,null,null,null,null,null,null,null,null,null,null,null,null,null,null,null,null,null,null,null,null,null,null,null,null,null,null,null,null,null,null,null,null,null,{"$f":"IF(SUM(AB11)<SUM(D81,D88,D95,D102),\"* La suma de Población Hombre 36 a 41 meses según resultado de Evaluación no puede ser mayor que la Población Hombres bajo control de la sección A. \",\"\")","v":""},{"$f":"IF(SUM(AC11)<SUM(E81,E88,E95,E102),\"* La suma de Población Hombre 36 a 41 meses según resultado de Evaluación no puede ser mayor que la Población Hombres bajo control de la sección A. \",\"\")","v":""},"","",null,null,null,null,null,null,null,null,null,null,null,null,null,null,null,null,null,null,null,null,{"$f":"IF(AB$11<SUM(D81,D88,D95,D102),1,0)","v":0},{"$f":"IF(AC$11<SUM(E81,E88,E95,E102),1,0)","v":0},0,0,0,0]
[null,"42 a 47 meses",{"$f":"SUM(D82:E82)","v":0},null,null,null,null,{"$f":"CF82&CG82&CH82&CI82&CJ82&CK82","v":""},null,null,null,null,null,null,null,null,null,null,null,null,null,null,null,null,null,null,null,null,null,null,null,null,null,null,null,null,null,null,null,null,null,null,null,null,null,null,null,null,null,null,null,null,null,null,null,null,null,null,null,null,null,null,null,null,null,null,null,null,null,null,null,null,null,null,null,null,null,null,null,null,null,null,null,{"$f":"IF(SUM(AD11)<SUM(D82,D89,D96,D103),\"* La suma de Población Hombre 42 a 47 meses según resultado de Evaluación no puede ser mayor que la Población Hombres bajo control de la sección A. \",\"\")","v":""},{"$f":"IF(SUM(AE11)<SUM(E82,E89,E96,E103),\"* La suma de Población Hombre 42 a 47 meses según resultado de Evaluación no puede ser mayor que la Población Hombres bajo control de la sección A. \",\"\")","v":""},"","",null,null,null,null,null,null,null,null,null,null,null,null,null,null,null,null,null,null,null,null,{"$f":"IF(AD$11<SUM(D82,D89,D96,D103),1,0)","v":0},{"$f":"IF(AE$11<SUM(E82,E89,E96,E103),1,0)","v":0},{"$f":"IF(F82>$C82,1,0)","v":0},{"$f":"IF(G82>$C82,1,0)","v":0},{"$f":"IF(AND($C82<>0,F82=\"\"),1,0)","v":0},{"$f":"IF(AND($C82<>0,G82=\"\"),1,0)","v":0}]
[null,"48 a 59 meses",0,null,null,null,null,"",null,null,null,null,null,null,null,null,null,null,null,null,null,null,null,null,null,null,null,null,null,null,null,null,null,null,null,null,null,null,null,null,null,null,null,null,null,null,null,null,null,null,null,null,null,null,null,null,null,null,null,null,null,null,null,null,null,null,null,null,null,null,null,null,null,null,null,null,null,null,null,null,null,null,null,{"$f":"IF(SUM(AF11)<SUM(D83,D90,D97,D104),\"* La suma de Población Hombre 48 a 59 meses según resultado de Evaluación no puede ser mayor que la Población Hombres bajo control de la sección A. \",\"\")","v":""},{"$f":"IF(SUM(AG11)<SUM(E83,E90,E97,E104),\"* La suma de Población Mujeres 48 a 59 meses según resultado de Evaluación no puede ser mayor que la Población Hombres bajo control de la sección A. \",\"\")","v":""},"","",null,null,null,null,null,null,null,null,null,null,null,null,null,null,null,null,null,null,null,null,{"$f":"IF(AF$11<SUM(D83,D90,D97,D104),1,0)","v":0},{"$f":"IF(AG$11<SUM(E83,E90,E97,E104),1,0)","v":0},0,0,0,0]
["NORMAL CON REZAGO","Menor de 12 meses",{"$f":"SUM(D84:E84)","v":0},null,null,null,null,"",null,null,null,null,null,null,null,null,null,null,null,null,null,null,null,null,null,null,null,null,null,null,null,null,null,null,null,null,null,null,null,null,null,null,null,null,null,null,null,null,null,null,null,null,null,null,null,null,null,null,null,null,null,null,null,null,null,null,null,null,null,null,null,null,null,null,null,null,null,null,null,null,null,null,null,null,null,"","",null,null,null,null,null,null,null,null,null,null,null,null,null,null,null,null,null,null,null,null,null,null,0,0,0,0]
[null,"12 a 17 meses",0,null,null,null,null,"",null,null,null,null,null,null,null,null,null,null,null,null,null,null,null,null,null,null,null,null,null,null,null,null,null,null,null,null,null,null,null,null,null,null,null,null,null,null,null,null,null,null,null,null,null,null,null,null,null,null,null,null,null,null,null,null,null,null,null,null,null,null,null,null,null,null,null,null,null,null,null,null,null,null,null,null,null,"","",null,null,null,null,null,null,null,null,null,null,null,null,null,null,null,null,null,null,null,null,null,null,0,0,0,0]
[null,"18 a 23 meses",0,null,null,null,null,"",null,null,null,null,null,null,null,null,null,null,null,null,null,null,null,null,null,null,null,null,null,null,null,null,null,null,null,null,null,null,null,null,null,null,null,null,null,null,null,null,null,null,null,null,null,null,null,null,null,null,null,null,null,null,null,null,null,null,null,null,null,null,null,null,null,null,null,null,null,null,null,null,null,null,null,null,null,"","",null,null,null,null,null,null,null,null,null,null,null,null,null,null,null,null,null,null,null,null,null,null,0,0,0,0]
[null,"24 a 35 meses",0,null,null,null,null,"",null,null,null,null,null,null,null,null,null,null,null,null,null,null,null,null,null,null,null,null,null,null,null,null,null,null,null,null,null,null,null,null,null,null,null,null,null,null,null,null,null,null,null,null,null,null,null,null,null,null,null,null,null,null,null,null,null,null,null,null,null,null,null,null,null,null,null,null,null,null,null,null,null,null,null,null,null,"","",null,null,null,null,null,null,null,null,null,null,null,null,null,null,null,null,null,null,null,null,null,null,0,0,0,0]
[null,"36 a 41 meses",0,null,null,null,null,"",null,null,null,null,null,null,null,null,null,null,null,null,null,null,null,null,null,null,null,null,null,null,null,null,null,null,null,null,null,null,null,null,null,null,null,null,null,null,null,null,null,null,null,null,null,null,null,null,null,null,null,null,null,null,null,null,null,null,null,null,null,null,null,null,null,null,null,null,null,null,null,null,null,null,null,null,null,"","",null,null,null,null,null,null,null,null,null,null,null,null,null,null,null,null,null,null,null,null,null,null,0,0,0,0]
[null,"42 a 47 meses",{"$f":"SUM(D89:E89)","v":0},null,null,null,null,"",null,null,null,null,null,null,null,null,null,null,null,null,null,null,null,null,null,null,null,null,null,null,null,null,null,null,null,null,null,null,null,null,null,null,null,null,null,null,null,null,null,null,null,null,null,null,null,null,null,null,null,null,null,null,null,null,null,null,null,null,null,null,null,null,null,null,null,null,null,null,null,null,null,null,null,null,null,"","",null,null,null,null,null,null,null,null,null,null,null,null,null,null,null,null,null,null,null,null,null,null,{"$f":"IF(F89>$C89,1,0)","v":0},{"$f":"IF(G89>$C89,1,0)","v":0},{"$f":"IF(AND($C89<>0,F89=\"\"),1,0)","v":0},{"$f":"IF(AND($C89<>0,G89=\"\"),1,0)","v":0}]
[null,"48 a 59 meses",0,null,null,null,null,"",null,null,null,null,null,null,null,null,null,null,null,null,null,null,null,null,null,null,null,null,null,null,null,null,null,null,null,null,null,null,null,null,null,null,null,null,null,null,null,null,null,null,null,null,null,null,null,null,null,null,null,null,null,null,null,null,null,null,null,null,null,null,null,null,null,null,null,null,null,null,null,null,null,null,null,null,null,"","",null,null,null,null,null,null,null,null,null,null,null,null,null,null,null,null,null,null,null,null,null,null,0,0,0,0]
["RIESGO","Menor de 12 meses",0,null,null,null,null,"",null,null,null,null,null,null,null,null,null,null,null,null,null,null,null,null,null,null,null,null,null,null,null,null,null,null,null,null,null,null,null,null,null,null,null,null,null,null,null,null,null,null,null,null,null,null,null,null,null,null,null,null,null,null,null,null,null,null,null,null,null,null,null,null,null,null,null,null,null,null,null,null,null,null,null,null,null,"","",null,null,null,null,null,null,null,null,null,null,null,null,null,null,null,null,null,null,null,null,null,null,0,0,0,0]
[null,"12 a 17 meses",0,null,null,null,null,"",null,null,null,null,null,null,null,null,null,null,null,null,null,null,null,null,null,null,null,null,null,null,null,null,null,null,null,null,null,null,null,null,null,null,null,null,null,null,null,null,null,null,null,null,null,null,null,null,null,null,null,null,null,null,null,null,null,null,null,null,null,null,null,null,null,null,null,null,null,null,null,null,null,null,null,null,null,"","",null,null,null,null,null,null,null,null,null,null,null,null,null,null,null,null,null,null,null,null,null,null,0,0,0,0]
[null,"18 a 23 meses",0,null,null,null,null,"",null,null,null,null,null,null,null,null,null,null,null,null,null,null,null,null,null,null,null,null,null,null,null,null,null,null,null,null,null,null,null,null,null,null,null,null,null,null,null,null,null,null,null,null,null,null,null,null,null,null,null,null,null,null,null,null,null,null,null,null,null,null,null,null,null,null,null,null,null,null,null,null,null,null,null,null,null,"","",null,null,null,null,null,null,null,null,null,null,null,null,null,null,null,null,null,null,null,null,null,null,0,0,0,0]
[null,"24 a 35 meses",0,null,null,null,null,"",null,null,null,null,null,null,null,null,null,null,null,null,null,null,null,null,null,null,null,null,null,null,null,null,null,null,null,null,null,null,null,null,null,null,null,null,null,null,null,null,null,null,null,null,null,null,null,null,null,null,null,null,null,null,null,null,null,null,null,null,null,null,null,null,null,null,null,null,null,null,null,null,null,null,null,null,null,"","",null,null,null,null,null,null,null,null,null,null,null,null,null,null,null,null,null,null,null,null,null,null,0,0,0,0]
[null,"36 a 41 meses",0,null,null,null,null,"",null,null,null,null,null,null,null,null,null,null,null,null,null,null,null,null,null,null,null,null,null,null,null,null,null,null,null,null,null,null,null,null,null,null,null,null,null,null,null,null,null,null,null,null,null,null,null,null,null,null,null,null,null,null,null,null,null,null,null,null,null,null,null,null,null,null,null,null,null,null,null,null,null,null,null,null,null,"","",null,null,null,null,null,null,null,null,null,null,null,null,null,null,null,null,null,null,null,null,null,null,0,0,0,0]
[null,"42 a 47 meses",0,null,null,null,null,"",null,null,null,null,null,null,null,null,null,null,null,null,null,null,null,null,null,null,null,null,null,null,null,null,null,null,null,null,null,null,null,null,null,null,null,null,null,null,null,null,null,null,null,null,null,null,null,null,null,null,null,null,null,null,null,null,null,null,null,null,null,null,null,null,null,null,null,null,null,null,null,null,null,null,null,null,null,"","",null,null,null,null,null,null,null,null,null,null,null,null,null,null,null,null,null,null,null,null,null,null,{"$f":"IF(F96>$C96,1,0)","v":0},{"$f":"IF(G96>$C96,1,0)","v":0},{"$f":"IF(AND($C96<>0,F96=\"\"),1,0)","v":0},{"$f":"IF(AND($C96<>0,G96=\"\"),1,0)","v":0}]
[null,"48 a 59 meses",0,null,null,null,null,"",null,null,null,null,null,null,null,null,null,null,null,null,null,null,null,null,null,null,null,null,null,null,null,null,null,null,null,null,null,null,null,null,null,null,null,null,null,null,null,null,null,null,null,null,null,null,null,null,null,null,null,null,null,null,null,null,null,null,null,null,null,null,null,null,null,null,null,null,null,null,null,null,null,null,null,null,null,"","",null,null,null,null,null,null,null,null,null,null,null,null,null,null,null,null,null,null,null,null,null,null,0,0,0,0]
["RETRASO","Menor de 12 meses",0,null,null,null,null,"",null,null,null,null,null,null,null,null,null,null,null,null,null,null,null,null,null,null,null,null,null,null,null,null,null,null,null,null,null,null,null,null,null,null,null,null,null,null,null,null,null,null,null,null,null,null,null,null,null,null,null,null,null,null,null,null,null,null,null,null,null,null,null,null,null,null,null,null,null,null,null,null,null,null,null,null,null,"","",null,null,null,null,null,null,null,null,null,null,null,null,null,null,null,null,null,null,null,null,null,null,0,0,0,0]
[null,"12 a 17 meses",0,null,null,null,null,"",null,null,null,null,null,null,null,null,null,null,null,null,null,null,null,null,null,null,null,null,null,null,null,null,null,null,null,null,null,null,null,null,null,null,null,null,null,null,null,null,null,null,null,null,null,null,null,null,null,null,null,null,null,null,null,null,null,null,null,null,null,null,null,null,null,null,null,null,null,null,null,null,null,null,null,null,null,"","",null,null,null,null,null,null,null,null,null,null,null,null,null,null,null,null,null,null,null,null,null,null,0,0,0,0]
[null,"18 a 23 meses",0,null,null,null,null,"",null,null,null,null,null,null,null,null,null,null,null,null,null,null,null,null,null,null,null,null,null,null,null,null,null,null,null,null,null,null,null,null,null,null,null,null,null,null,null,null,null,null,null,null,null,null,null,null,null,null,null,null,null,null,null,null,null,null,null,null,null,null,null,null,null,null,null,null,null,null,null,null,null,null,null,null,null,"","",null,null,null,null,null,null,null,null,null,null,null,null,null,null,null,null,null,null,null,null,null,null,0,0,0,0]
[null,"24 a 35 meses",0,null,null,null,null,"",null,null,null,null,null,null,null,null,null,null,null,null,null,null,null,null,null,null,null,null,null,null,null,null,null,null,null,null,null,null,null,null,null,null,null,null,null,null,null,null,null,null,null,null,null,null,null,null,null,null,null,null,null,null,null,null,null,null,null,null,null,null,null,null,null,null,null,null,null,null,null,null,null,null,null,null,null,"","",null,null,null,null,null,null,null,null,null,null,null,null,null,null,null,null,null,null,null,null,null,null,0,0,0,0]
[null,"36 a 41 meses",{"$f":"SUM(D102:E102)","v":0},null,null,null,null,"",null,null,null,null,null,null,null,null,null,null,null,null,null,null,null,null,null,null,null,null,null,null,null,null,null,null,null,null,null,null,null,null,null,null,null,null,null,null,null,null,null,null,null,null,null,null,null,null,null,null,null,null,null,null,null,null,null,null,null,null,null,null,null,null,null,null,null,null,null,null,null,null,null,null,null,null,null,"","",null,null,null,null,null,null,null,null,null,null,null,null,null,null,null,null,null,null,null,null,null,null,0,0,0,0]
[null,"42 a 47 meses",{"$f":"SUM(D103:E103)","v":0},null,null,null,null,"",null,null,null,null,null,null,null,null,null,null,null,null,null,null,null,null,null,null,null,null,null,null,null,null,null,null,null,null,null,null,null,null,null,null,null,null,null,null,null,null,null,null,null,null,null,null,null,null,null,null,null,null,null,null,null,null,null,null,null,null,null,null,null,null,null,null,null,null,null,null,null,null,null,null,null,null,null,"","",null,null,null,null,null,null,null,null,null,null,null,null,null,null,null,null,null,null,null,null,null,null,{"$f":"IF(F103>$C103,1,0)","v":0},{"$f":"IF(G103>$C103,1,0)","v":0},{"$f":"IF(AND($C103<>0,F103=\"\"),1,0)","v":0},{"$f":"IF(AND($C103<>0,G103=\"\"),1,0)","v":0}]
[null,"48 a 59 meses",{"$f":"SUM(D104:E104)","v":0},null,null,null,null,"",null,null,null,null,null,null,null,null,null,null,null,null,null,null,null,null,null,null,null,null,null,null,null,null,null,null,null,null,null,null,null,null,null,null,null,null,null,null,null,null,null,null,null,null,null,null,null,null,null,null,null,null,null,null,null,null,null,null,null,null,null,null,null,null,null,null,null,null,null,null,null,null,null,null,null,null,null,"","",null,null,null,null,null,null,null,null,null,null,null,null,null,null,null,null,null,null,null,null,null,null,0,0,0,0]
["SECCION C: POBLACIÓN MENOR DE 1 AÑO EN CONTROL, SEGÚN SCORE RIESGO EN IRA Y VISITA DOMICILIARIA INTEGRAL "]
["RESULTADO",null,"TOTAL","Diada, menor de 10 días","1 mes","2 meses","3 meses","4 meses","5 meses","6 meses","7 a 12 meses","Total de Niños y Niñas que han recibido VDI","Pueblos Originarios","Migrantes"]
[]
["SCORE \nDE RIESGO","LEVE",{"$f":"SUM(D108:K108)","v":0},null,null,null,null,null,null,null,null,null,null,null,{"$f":"CF108&CH108&CI108&CJ108&CK108","v":""},null,null,null,null,null,null,null,null,null,null,null,null,null,null,null,null,null,null,null,null,null,null,null,null,null,null,null,null,null,null,null,null,null,null,null,null,null,null,null,null,null,null,null,null,null,null,null,null,null,null,null,null,null,null,null,null,null,null,null,null,null,null,null,null,null,null,null,null,null,null,{"$f":"IF(M108>$C108,\" * El Total de Pueblos Originarios no puede ser mayor que el Total. \",\"\")","v":""},{"$f":"IF(N108>$C108,\" * El Total según Población Migrante no puede ser mayor que el Total. \",\"\")","v":""},{"$f":"IF(AND($C108<>0,M108=\"\"),\"* No olvide ingresar el total según Pueblos Originarios (Digite 0 si no tiene). \",\"\")","v":""},{"$f":"IF(AND($C108<>0,N108=\"\"),\"* No olvide ingresar el total según Pueblos Originarios (Digite 0 si no tiene). \",\"\")","v":""},null,null,null,null,null,null,null,null,null,null,null,null,null,null,null,null,null,null,null,null,{"$f":"IF(M108>$C108,1,0)","v":0},{"$f":"IF(N108>$C108,1,0)","v":0},{"$f":"IF(AND($C108<>0,N108=\"\"),1,0)","v":0},{"$f":"IF(AND($C108<>0,N108=\"\"),1,0)","v":0}]
[null,"MODERADO",{"$f":"SUM(D109:K109)","v":0},null,null,null,null,null,null,null,null,null,null,null,{"$f":"CF109&CH109&CI109&CJ109&CK109","v":""},null,null,null,null,null,null,null,null,null,null,null,null,null,null,null,null,null,null,null,null,null,null,null,null,null,null,null,null,null,null,null,null,null,null,null,null,null,null,null,null,null,null,null,null,null,null,null,null,null,null,null,null,null,null,null,null,null,null,null,null,null,null,null,null,null,null,null,null,{"$f":"IF($C109<$L109, \"* Total de Niños y Niñas que han recibido VDI no puede ser mayor que el total Score Moderado. \",\"\")","v":""},null,{"$f":"IF(M109>$C109,\" * El Total de Pueblos Originarios no puede ser mayor que el Total. \",\"\")","v":""},{"$f":"IF(N109>$C109,\" * El Total según Población Migrante no puede ser mayor que el Total. \",\"\")","v":""},{"$f":"IF(AND($C109<>0,M109=\"\"),\"* No olvide ingresar el total según Pueblos Originarios (Digite 0 si no tiene). \",\"\")","v":""},{"$f":"IF(AND($C109<>0,N109=\"\"),\"* No olvide ingresar el total según Pueblos Originarios (Digite 0 si no tiene). \",\"\")","v":""},null,null,null,null,null,null,null,null,null,null,null,null,null,null,null,null,null,null,{"$f":"IF($C109<$L109, 1,0)","v":0},null,{"$f":"IF(M109>$C109,1,0)","v":0},{"$f":"IF(N109>$C109,1,0)","v":0},{"$f":"IF(AND($C109<>0,N109=\"\"),1,0)","v":0},{"$f":"IF(AND($C109<>0,N109=\"\"),1,0)","v":0}]
[null,"GRAVE",{"$f":"SUM(D110:K110)","v":0},null,null,null,null,null,null,null,null,null,null,null,"",null,null,null,null,null,null,null,null,null,null,null,null,null,null,null,null,null,null,null,null,null,null,null,null,null,null,null,null,null,null,null,null,null,null,null,null,null,null,null,null,null,null,null,null,null,null,null,null,null,null,null,null,null,null,null,null,null,null,null,null,null,null,null,null,null,null,null,null,{"$f":"IF($C110<$L110, \"* Total de Niños y Niñas que han recibido VDI no puede ser mayor que el total Score Grave. \",\"\")","v":""},null,"","","","",null,null,null,null,null,null,null,null,null,null,null,null,null,null,null,null,null,null,{"$f":"IF($C110<$L110,1,0)","v":0},null,0,0,0,0]
[null,"TOTAL",{"$f":"SUM(D111:K111)","v":0},{"$f":"SUM(D108:D110)","v":0},0,0,0,0,0,{"$f":"SUM(J108:J110)","v":0},0,{"$f":"SUM(L109:L110)","v":0},{"$f":"SUM(M108:M110)","v":0},{"$f":"SUM(N108:N110)","v":0}]
["SECCION D: POBLACIÓN EN CONTROL EN EL SEMESTRE CON CONSULTA NUTRICIONAL, SEGÚN ESTRATEGIA"]
["NIÑO/A CON CONSULTA NUTRICIONAL EN",null,"TOTAL"]
[]
["Del 5to mes"]
["De los 3 años y 6 meses"]
["SECCION E: POBLACIÓN INASISTENTE A CONTROL DEL NIÑO SANO (AL CORTE)"]
["EDAD",null,"TOTAL"]
[]
["0 - 11 meses"]
["12 - 24 meses"]
["25 - 35 meses"]
["36 - 59 meses"]
["60 meses - 9 años"]
["TOTAL",null,{"$f":"SUM(C120:C124)","v":0}]
["SECCION F: POBLACIÓN INFANTIL SEGÚN DIAGNÓSTICO DE PRESIÓN ARTERIAL (Incluida en sección A y A1)"]
["CLASIFICACIÓN",null,"Total",null,null,"GRUPOS DE EDAD (en meses)",null,null,null,null,null,"Derivación Nivel Secundario"]
[null,null,null,null,null,"36 a 47 meses",null,"48 a 71 meses",null,"6-9 años"]
[null,null,"Total","Hombres","Mujeres","Hombres","Mujeres","Hombres","Mujeres","Hombres","Mujeres"]
["NORMAL (PA menor al percentil 90)",null,{"$f":"SUM(D130:E130)","v":0},{"$f":"+F130+H130+J130","v":0},{"$f":"+G130+I130+K130","v":0},null,null,null,null,null,null,null,{"$f":"CI130&CJ130&CK130","v":""},null,null,null,null,null,null,null,null,null,null,null,null,null,null,null,null,null,null,null,null,null,null,null,null,null,null,null,null,null,null,null,null,null,null,null,null,null,null,null,null,null,null,null,null,null,null,null,null,null,null,null,null,null,null,null,null,null,null,null,null,null,null,null,null,null,null,null,null,null,null,null,null,null,{"$f":"IF(SUM($F130:$G130)<=SUM($AB$11:$AE$11),\"\",\"* Niños(as) de 36 a 47 ms clasificados debe ser menor o igual al Total de la población de niños bajo control de en sección A misma edad. \")","v":""},{"$f":"IF(SUM($H130:$I130)<=SUM($AF$11:$AG$11,$F$44:$G$44),\"\",\"* Niños(as) de 48 a 71 meses clasificados debe ser menor o igual al Total de la población de niños bajo control de en sección A y A1 de la misma edad. \")","v":""},{"$f":"IF(SUM($J130:$K130)<=SUM($H$44:$O$44),\"\",\"* Niños(as) de 6 a 9 años clasificados debe ser menor o igual al Total de la población de niños bajo control de en sección A1 misma edad \")","v":""},null,null,null,null,null,null,null,null,null,null,null,null,null,null,null,null,null,null,{"$f":"IF(SUM($F130:$G130)<=SUM($AB$11:$AE$11),0,1)","v":0},{"$f":"IF(SUM($H130:$I130)<=SUM($AF$11:$AG$11,$F$44:$G$44),0,1)","v":0},{"$f":"IF(SUM($J130:$K130)<=SUM($H$44:$O$44),0,1)","v":0}]
["PRESIÓN ARTERIAL ELEVADA",null,{"$f":"SUM(D131:E131)","v":0},{"$f":"+F131+H131+J131","v":0},{"$f":"+G131+I131+K131","v":0},null,null,null,null,null,null,null,{"$f":"CI131&CJ131&CK131","v":""},null,null,null,null,null,null,null,null,null,null,null,null,null,null,null,null,null,null,null,null,null,null,null,null,null,null,null,null,null,null,null,null,null,null,null,null,null,null,null,null,null,null,null,null,null,null,null,null,null,null,null,null,null,null,null,null,null,null,null,null,null,null,null,null,null,null,null,null,null,null,null,null,null,{"$f":"IF(SUM($F131:$G131)<=SUM($AB$11:$AE$11),\"\",\"* Niños(as) de 36 a 47 ms clasificados debe ser menor o igual al Total de la población de niños bajo control de en sección A misma edad. \")","v":""},{"$f":"IF(SUM($H131:$I131)<=SUM($AF$11:$AG$11,$F$44:$G$44),\"\",\"* Niños(as) de 48 a 71 meses clasificados debe ser menor o igual al Total de la población de niños bajo control de en sección A y A1 de la misma edad. \")","v":""},{"$f":"IF(SUM($J131:$K131)<=SUM($H$44:$O$44),\"\",\"* Niños(as) de 6 a 9 años clasificados debe ser menor o igual al Total de la población de niños bajo control de en sección A1 misma edad \")","v":""},null,null,null,null,null,null,null,null,null,null,null,null,null,null,null,null,null,null,{"$f":"IF(SUM($F131:$G131)<=SUM($AB$11:$AE$11),0,1)","v":0},{"$f":"IF(SUM($H131:$I131)<=SUM($AF$11:$AG$11,$F$44:$G$44),0,1)","v":0},{"$f":"IF(SUM($J131:$K131)<=SUM($H$44:$O$44),0,1)","v":0}]
["HTA ESTADIO I ",null,0,{"$f":"+F132+H132+J132","v":0},0,null,null,null,null,null,null,null,"",null,null,null,null,null,null,null,null,null,null,null,null,null,null,null,null,null,null,null,null,null,null,null,null,null,null,null,null,null,null,null,null,null,null,null,null,null,null,null,null,null,null,null,null,null,null,null,null,null,null,null,null,null,null,null,null,null,null,null,null,null,null,null,null,null,null,null,null,null,null,null,null,null,"",{"$f":"IF(SUM($H132:$I132)<=SUM($AF$11:$AG$11,$F$44:$G$44),\"\",\"* Niños(as) de 48 a 71 meses clasificados debe ser menor o igual al Total de la población de niños bajo control de en sección A y A1 de la misma edad. \")","v":""},"",null,null,null,null,null,null,null,null,null,null,null,null,null,null,null,null,null,null,{"$f":"IF(SUM($F132:$G132)<=SUM($AB$11:$AE$11),0,1)","v":0},{"$f":"IF(SUM($H132:$I132)<=SUM($AF$11:$AG$11,$F$44:$G$44),0,1)","v":0},0]
["HTA ESTADIO II",null,0,0,0,null,null,null,null,null,null,null,"",null,null,null,null,null,null,null,null,null,null,null,null,null,null,null,null,null,null,null,null,null,null,null,null,null,null,null,null,null,null,null,null,null,null,null,null,null,null,null,null,null,null,null,null,null,null,null,null,null,null,null,null,null,null,null,null,null,null,null,null,null,null,null,null,null,null,null,null,null,null,null,null,null,{"$f":"IF(SUM($F133:$G133)<=SUM($AB$11:$AE$11),\"\",\"* Niños(as) de 36 a 47 ms clasificados debe ser menor o igual al Total de la población de niños bajo control de en sección A misma edad. \")","v":""},{"$f":"IF(SUM($H133:$I133)<=SUM($AF$11:$AG$11,$F$44:$G$44),\"\",\"* Niños(as) de 48 a 71 meses clasificados debe ser menor o igual al Total de la población de niños bajo control de en sección A y A1 de la misma edad. \")","v":""},"",null,null,null,null,null,null,null,null,null,null,null,null,null,null,null,null,null,null,0,{"$f":"IF(SUM($H133:$I133)<=SUM($AF$11:$AG$11,$F$44:$G$44),0,1)","v":0},0]
["TOTAL",null,{"$f":"SUM(D134:E134)","v":0},{"$f":"+F134+H134+J134","v":0},{"$f":"+G134+I134+K134","v":0},{"$f":"SUM(F130:F133)","v":0},{"$f":"SUM(G130:G133)","v":0},{"$f":"SUM(H130:H133)","v":0},0,0,{"$f":"SUM(K130:K133)","v":0},{"$f":"SUM(L130:L133)","v":0}]
["SECCION G: POBLACIÓN INFANTIL EUTRÓFICA, SEGÚN RIESGO DE MALNUTRICIÓN POR EXCESO (Incluida en sección A y A1)"]
["RESULTADO",null,"TOTAL","GRUPOS DE EDAD (en meses)"]
[null,null,null,"4 a 11 meses","12 a 23 meses","24 a 35 meses","36 a 47 meses","48 a 59 meses","60 a 71 meses"]
["SIN RIESGO",null,{"$f":"SUM(D138:I138)","v":0},null,null,null,null,null,null,{"$f":" CF138 & CG138 & CH138 & CI138 & CJ138 & CK138","v":""},null,null,null,null,null,null,null,null,null,null,null,null,null,null,null,null,null,null,null,null,null,null,null,null,null,null,null,null,null,null,null,null,null,null,null,null,null,null,null,null,null,null,null,null,null,null,null,null,null,null,null,null,null,null,null,null,null,null,null,null,null,null,null,null,null,null,null,null,null,null,null,null,null,{"$f":"IF($D138<=SUM($N$35:$U$35),\"\",\"* Niños(as) de 4 a 11 ms clasificados debe ser menor o igual al Total niños diagnostidos en NORMAL sección A misma edad. \")","v":""},{"$f":"IF($E138<=SUM($V$35:$Y$35),\"\",\"* Niños(as) de 12 a 23 ms clasificados debe ser menor o igual al Total niños diagnosticados en NORMAL en sección A misma edad. \")","v":""},{"$f":"IF($F138<=SUM($Z$35:$AA$35),\"\",\"* Niños(as) de 24 a 35 ms clasificados debe ser menor o igual al Total niños diagnosticados en NORMAL en sección A misma edad. \")","v":""},{"$f":"IF($G138<=SUM($AB$35:$AC$35),\"\",\"* Niños(as) de 36 a 47 ms clasificados debe ser menor o igual al Total niños diagnosticos en NORMAL en sección A misma edad. \")","v":""},{"$f":"IF($H138<=SUM($AF$35:$AG$35),\"\",\"* Niños(as) de 48 a 59 ms clasificados debe ser menor o igual al Total niños diagnosticados en NORMAL en sección A misma edad. \")","v":""},{"$f":"IF($I138<=SUM($F$69:$G$69),\"\",\"* Niños(as) de 60 a 71 ms clasificados debe ser menor o igual al Total niños diagnosticados en NORMAL en sección A1 misma edad. \")","v":""},null,null,null,null,null,null,null,null,null,null,null,null,null,null,null,null,null,null,null,null,{"$f":"IF($D138<=SUM($N$35:$U$35),0,1)","v":0},{"$f":"IF($E138<=SUM($V$35:$Y$35),0,1)","v":0},{"$f":"IF($F138<=SUM($Z$35:$AA$35),0,1)","v":0},{"$f":"IF($G138<=SUM($AB$35:$AC$35),0,1)","v":0},{"$f":"IF($H138<=SUM($AF$35:$AG$35),0,1)","v":0},{"$f":"IF($I138<=SUM($F$69:$G$69),0,1)","v":0}]
["CON RIESGO",null,{"$f":"SUM(D139:I139)","v":0},null,null,null,null,null,null,{"$f":" CF139 & CG139 & CH139 & CI139 & CJ139 & CK139","v":""},null,null,null,null,null,null,null,null,null,null,null,null,null,null,null,null,null,null,null,null,null,null,null,null,null,null,null,null,null,null,null,null,null,null,null,null,null,null,null,null,null,null,null,null,null,null,null,null,null,null,null,null,null,null,null,null,null,null,null,null,null,null,null,null,null,null,null,null,null,null,null,null,null,{"$f":"IF($D139<=SUM($N$35:$U$35),\"\",\"* Niños(as) de 4 a 11 ms clasificados debe ser menor o igual al Total niños diagnostidos en NORMAL sección A misma edad. \")","v":""},{"$f":"IF($E139<=SUM($V$35:$Y$35),\"\",\"* Niños(as) de 12 a 23 ms clasificados debe ser menor o igual al Total niños diagnosticados en NORMAL en sección A misma edad. \")","v":""},{"$f":"IF($F139<=SUM($Z$35:$AA$35),\"\",\"* Niños(as) de 24 a 35 ms clasificados debe ser menor o igual al Total niños diagnosticados en NORMAL en sección A misma edad. \")","v":""},{"$f":"IF($G139<=SUM($AB$35:$AC$35),\"\",\"* Niños(as) de 36 a 47 ms clasificados debe ser menor o igual al Total niños diagnosticos en NORMAL en sección A misma edad. \")","v":""},{"$f":"IF($H139<=SUM($AF$35:$AG$35),\"\",\"* Niños(as) de 48 a 59 ms clasificados debe ser menor o igual al Total niños diagnosticados en NORMAL en sección A misma edad. \")","v":""},{"$f":"IF($I139<=SUM($F$69:$G$69),\"\",\"* Niños(as) de 60 a 71 ms clasificados debe ser menor o igual al Total niños diagnosticados en NORMAL en sección A1 misma edad. \")","v":""},null,null,null,null,null,null,null,null,null,null,null,null,null,null,null,null,null,null,null,null,{"$f":"IF($D139<=SUM($N$35:$U$35),0,1)","v":0},{"$f":"IF($E139<=SUM($V$35:$Y$35),0,1)","v":0},{"$f":"IF($F139<=SUM($Z$35:$AA$35),0,1)","v":0},{"$f":"IF($G139<=SUM($AB$35:$AC$35),0,1)","v":0},{"$f":"IF($H139<=SUM($AF$35:$AG$35),0,1)","v":0},{"$f":"IF($I139<=SUM($F$69:$G$69),0,1)","v":0}]
["TOTAL",null,{"$f":"SUM(D140:I140)","v":0},{"$f":"SUM(D138:D139)","v":0},0,0,0,0,0,{"$f":" CF140 & CG140 & CH140 & CI140 & CJ140 & CK140","v":""}]
["SECCION H: POBLACIÓN SEGÚN DIAGNÓSTICO DE NIÑOS, NIÑAS Y ADOLESCENTES CON NECESIDADES ESPECIALES DE ATENCIÓN EN SALUD (NANEAS) (Incluida en sección A y A1)"]
["DIAGNOSTICOS",null,"TOTAL",null,null,"GRUPOS DE EDAD (en meses - años) Y SEXO",null,null,null,null,null,null,null,null,null,null,null,null,null,null,null,null,null,null,null,null,null,null,null,null,null,null,null,null,null,null,null,null,null,null,null,null,null,"Pueblos Originarios",null,"Población Migrantes"]
[null,null,null,null,null,"Menor de 1 mes",null,"1 mes",null,"2 meses",null,"3 meses",null,"4 meses",null,"5 meses",null,"6 meses",null,"7 a 11 meses",null,"12 a 17 meses",null,"18 a 23 meses",null,"24 a 35 meses",null,"36 a 41 meses",null,"42 a 47 meses",null,"48 a 59 meses",null,"60 a 71 meses",null,"6 a 7 años",null,"8 a 9 años",null,"10 a 14 años",null,"15 a 19 años"]
[null,null,"Ambos sexos","Hombres","Mujeres","Hombres","Mujeres","Hombres","Mujeres","Hombres","Mujeres","Hombres","Mujeres","Hombres","Mujeres","Hombres","Mujeres","Hombres","Mujeres","Hombres","Mujeres","Hombres","Mujeres","Hombres","Mujeres","Hombres","Mujeres","Hombres","Mujeres","Hombres","Mujeres","Hombres","Mujeres","Hombres","Mujeres","Hombres","Mujeres","Hombres","Mujeres","Hombres","Mujeres","Hombres","Mujeres","Hombres","Mujeres","Hombres","Mujeres"]
["TOTAL POBLACIÓN NANEAS BAJO CONTROL",null,{"$f":"SUM(D145:E145)","v":0},{"$f":"+F145+H145+J145+L145+N145+P145+R145+T145+V145+X145+Z145+AB145+AD145+AF145+AH145+AN145+AP145+AJ145+AL145","v":0},{"$f":"+G145+I145+K145+M145+O145+Q145+S145+U145+W145+Y145+AA145+AC145+AE145+AG145+AI145+AO145+AQ145+AK145+AM145","v":0},null,null,null,null,null,null,null,null,null,null,null,null,null,null,null,null,null,null,null,null,null,null,null,null,null,null,null,null,null,null,null,null,null,null,null,null,null,null,null,null,null,null,{"$f":"CB145&CC145&CD145&CE145","v":""},null,null,null,null,null,null,null,null,null,null,null,null,null,null,null,null,null,null,null,null,null,null,null,null,null,null,null,null,null,null,null,{"$f":"IF(AND(D145>0,AR145=\"\"),\" * No olvide digitar la variable Pueblos Originarios  hombres (Digite Cero si no tiene).\",IF(AR145>D145,\" * La variable Pueblos Originarios  hombres  no debe ser mayor que el Total de Hombres.\",\"\"))","v":""},{"$f":"IF(AND(E145>0,AS145=\"\"),\" * No olvide digitar la variable Pueblos Originarios Mujeres (Digite Cero si no tiene). Digite Cero si no tiene.\",IF(AS145>E145,\" * La variable Pueblos Originarios Mujeres no debe ser mayor que el Total de Mujeres\",\"\"))","v":""},{"$f":"IF(AND(D145>0,AT145=\"\"),\" * No olvide digitar la variable Migrantes hombres (Digite Cero si no tiene).\",IF(AT145>D145,\" * La variable Migrantes  hombres  no debe ser mayor que el Total de Hombres\",\"\"))","v":""},{"$f":"IF(AND(E145>0,AU145=\"\"),\" * No olvide digitar la variable Migrantes Mujeres (Digite Cero si no tiene).\",IF(AU145>E145,\" * La variable Migrantes  Mujeres no debe ser mayor que el Total de Mujeres\",\"\"))","v":""},null,null,null,null,null,null,null,null,null,null,null,null,null,null,null,null,null,null,null,null,null,null,null,null,null,null,{"$f":"IF(AND(D145>0,AR145=\"\"),1,IF(AR145>D145,1,0))","v":0},{"$f":"IF(AND(E145>0,AS145=\"\"),1,IF(AS145>E145,1,0))","v":0},{"$f":"IF(AND(D145>0,AT145=\"\"),1,IF(AT145>D145,1,0))","v":0},{"$f":"IF(AND(E145>0,AU145=\"\"),1,IF(AU145>E145,1,0))","v":0}]
["Síndrome de Down ",null,0,0,0,null,null,null,null,null,null,null,null,null,null,null,null,null,null,null,null,null,null,null,null,null,null,null,null,null,null,null,null,null,null,null,null,null,null,null,null,null,null,null,null,null,null,"",null,null,null,null,null,null,null,null,null,null,null,null,null,null,null,null,null,null,null,null,null,null,null,null,null,null,null,null,null,null,null,{"$f":"IF(AND(D146>0,AR146=\"\"),\" * No olvide digitar la variable Pueblos Originarios  hombres (Digite Cero si no tiene).\",IF(AR146>D146,\" * La variable Pueblos Originarios  hombres  no debe ser mayor que el Total de Hombres.\",\"\"))","v":""},{"$f":"IF(AND(E146>0,AS146=\"\"),\" * No olvide digitar la variable Pueblos Originarios Mujeres (Digite Cero si no tiene). Digite Cero si no tiene.\",IF(AS146>E146,\" * La variable Pueblos Originarios Mujeres no debe ser mayor que el Total de Mujeres\",\"\"))","v":""},{"$f":"IF(AND(D146>0,AT146=\"\"),\" * No olvide digitar la variable Migrantes hombres (Digite Cero si no tiene).\",IF(AT146>D146,\" * La variable Migrantes  hombres  no debe ser mayor que el Total de Hombres\",\"\"))","v":""},{"$f":"IF(AND(E146>0,AU146=\"\"),\" * No olvide digitar la variable Migrantes Mujeres (Digite Cero si no tiene).\",IF(AU146>E146,\" * La variable Migrantes  Mujeres no debe ser mayor que el Total de Mujeres\",\"\"))","v":""},null,null,null,null,null,null,null,null,null,null,null,null,null,null,null,null,null,null,null,null,null,null,null,null,null,null,{"$f":"IF(AND(D146>0,AR146=\"\"),1,IF(AR146>D146,1,0))","v":0},{"$f":"IF(AND(E146>0,AS146=\"\"),1,IF(AS146>E146,1,0))","v":0},{"$f":"IF(AND(D146>0,AT146=\"\"),1,IF(AT146>D146,1,0))","v":0},{"$f":"IF(AND(E146>0,AU146=\"\"),1,IF(AU146>E146,1,0))","v":0}]
["Trastorno del Espectro Autista ","Trastorno del Espectro Autista ",0,0,0,null,null,null,null,null,null,null,null,null,null,null,null,null,null,null,null,null,null,null,null,null,null,null,null,null,null,null,null,null,null,null,null,null,null,null,null,null,null,null,null,null,null,"",null,null,null,null,null,null,null,null,null,null,null,null,null,null,null,null,null,null,null,null,null,null,null,null,null,null,null,null,null,null,null,"","","","",null,null,null,null,null,null,null,null,null,null,null,null,null,null,null,null,null,null,null,null,null,null,null,null,null,null,0,0,0,0]
["Síndrome de Rett ","Síndrome de Rett ",0,0,0,null,null,null,null,null,null,null,null,null,null,null,null,null,null,null,null,null,null,null,null,null,null,null,null,null,null,null,null,null,null,null,null,null,null,null,null,null,null,null,null,null,null,"",null,null,null,null,null,null,null,null,null,null,null,null,null,null,null,null,null,null,null,null,null,null,null,null,null,null,null,null,null,null,null,"","","","",null,null,null,null,null,null,null,null,null,null,null,null,null,null,null,null,null,null,null,null,null,null,null,null,null,null,0,0,0,0]
["Parálisis Cerebral ","Parálisis Cerebral ",0,0,0,null,null,null,null,null,null,null,null,null,null,null,null,null,null,null,null,null,null,null,null,null,null,null,null,null,null,null,null,null,null,null,null,null,null,null,null,null,null,null,null,null,null,"",null,null,null,null,null,null,null,null,null,null,null,null,null,null,null,null,null,null,null,null,null,null,null,null,null,null,null,null,null,null,null,"","","","",null,null,null,null,null,null,null,null,null,null,null,null,null,null,null,null,null,null,null,null,null,null,null,null,null,null,0,0,0,0]
["Epilepsia ","Epilepsia ",0,0,0,null,null,null,null,null,null,null,null,null,null,null,null,null,null,null,null,null,null,null,null,null,null,null,null,null,null,null,null,null,null,null,null,null,null,null,null,null,null,null,null,null,null,"",null,null,null,null,null,null,null,null,null,null,null,null,null,null,null,null,null,null,null,null,null,null,null,null,null,null,null,null,null,null,null,"","","","",null,null,null,null,null,null,null,null,null,null,null,null,null,null,null,null,null,null,null,null,null,null,null,null,null,null,0,0,0,0]
["Otros trastornos del Neurodesarrollo (no incluye TEA) ","Otros trastornos del Neurodesarrollo  ( no incluye TEA)",0,0,0,null,null,null,null,null,null,null,null,null,null,null,null,null,null,null,null,null,null,null,null,null,null,null,null,null,null,null,null,null,null,null,null,null,null,null,null,null,null,null,null,null,null,"",null,null,null,null,null,null,null,null,null,null,null,null,null,null,null,null,null,null,null,null,null,null,null,null,null,null,null,null,null,null,null,"","","","",null,null,null,null,null,null,null,null,null,null,null,null,null,null,null,null,null,null,null,null,null,null,null,null,null,null,0,0,0,0]
["Hipertensión Arterial ","Hipertensión Arterial (En vez de Presión Arterial Elevada) ",0,0,0,null,null,null,null,null,null,null,null,null,null,null,null,null,null,null,null,null,null,null,null,null,null,null,null,null,null,null,null,null,null,null,null,null,null,null,null,null,null,null,null,null,null,"",null,null,null,null,null,null,null,null,null,null,null,null,null,null,null,null,null,null,null,null,null,null,null,null,null,null,null,null,null,null,null,"","","","",null,null,null,null,null,null,null,null,null,null,null,null,null,null,null,null,null,null,null,null,null,null,null,null,null,null,0,0,0,0]
["Enfermedad renal crónica ","Enfermedad renal crónica ",0,0,0,null,null,null,null,null,null,null,null,null,null,null,null,null,null,null,null,null,null,null,null,null,null,null,null,null,null,null,null,null,null,null,null,null,null,null,null,null,null,null,null,null,null,"",null,null,null,null,null,null,null,null,null,null,null,null,null,null,null,null,null,null,null,null,null,null,null,null,null,null,null,null,null,null,null,"","","","",null,null,null,null,null,null,null,null,null,null,null,null,null,null,null,null,null,null,null,null,null,null,null,null,null,null,0,0,0,0]
["Otras Enfermedades cardiovasculares crónicas (no incluye Hipertensión Arterial ni Cardiopatías Congénitas)","Otras Enfermedades cardiovasculares crónicas (no incluye Hipertensión Arterial ni Cardiopatías Congénitas)",0,0,0,null,null,null,null,null,null,null,null,null,null,null,null,null,null,null,null,null,null,null,null,null,null,null,null,null,null,null,null,null,null,null,null,null,null,null,null,null,null,null,null,null,null,"",null,null,null,null,null,null,null,null,null,null,null,null,null,null,null,null,null,null,null,null,null,null,null,null,null,null,null,null,null,null,null,"","","","",null,null,null,null,null,null,null,null,null,null,null,null,null,null,null,null,null,null,null,null,null,null,null,null,null,null,0,0,0,0]
["Enfermedades gastrointestinales crónicas (no incluye enfermedad celiaca)","Enfermedades crónicas gastrointestinales (no incluye enfermedad celiaca)",0,0,0,null,null,null,null,null,null,null,null,null,null,null,null,null,null,null,null,null,null,null,null,null,null,null,null,null,null,null,null,null,null,null,null,null,null,null,null,null,null,null,null,null,null,"",null,null,null,null,null,null,null,null,null,null,null,null,null,null,null,null,null,null,null,null,null,null,null,null,null,null,null,null,null,null,null,"","","","",null,null,null,null,null,null,null,null,null,null,null,null,null,null,null,null,null,null,null,null,null,null,null,null,null,null,0,0,0,0]
["Enfermedades crónicas del sistema visual (no incluye estrabismo ni errores de refracción)","Enfermedades crónicas del sistema visual (no incluye Estabismo ni Errores de Refracción)",0,0,0,null,null,null,null,null,null,null,null,null,null,null,null,null,null,null,null,null,null,null,null,null,null,null,null,null,null,null,null,null,null,null,null,null,null,null,null,null,null,null,null,null,null,"",null,null,null,null,null,null,null,null,null,null,null,null,null,null,null,null,null,null,null,null,null,null,null,null,null,null,null,null,null,null,null,"","","","",null,null,null,null,null,null,null,null,null,null,null,null,null,null,null,null,null,null,null,null,null,null,null,null,null,null,0,0,0,0]
["Enfermedades crónicas del oído ","Enfermedades crónicas del oído ",0,0,0,null,null,null,null,null,null,null,null,null,null,null,null,null,null,null,null,null,null,null,null,null,null,null,null,null,null,null,null,null,null,null,null,null,null,null,null,null,null,null,null,null,null,"",null,null,null,null,null,null,null,null,null,null,null,null,null,null,null,null,null,null,null,null,null,null,null,null,null,null,null,null,null,null,null,"","","","",null,null,null,null,null,null,null,null,null,null,null,null,null,null,null,null,null,null,null,null,null,null,null,null,null,null,0,0,0,0]
["Enfermedades crónicas de piel y mucosas ","Enfermedades crónicas de piel y mucosas ",0,0,0,null,null,null,null,null,null,null,null,null,null,null,null,null,null,null,null,null,null,null,null,null,null,null,null,null,null,null,null,null,null,null,null,null,null,null,null,null,null,null,null,null,null,"",null,null,null,null,null,null,null,null,null,null,null,null,null,null,null,null,null,null,null,null,null,null,null,null,null,null,null,null,null,null,null,"","","","",null,null,null,null,null,null,null,null,null,null,null,null,null,null,null,null,null,null,null,null,null,null,null,null,null,null,0,0,0,0]
["Neoplasias  ","Neoplasias  ",0,0,0,null,null,null,null,null,null,null,null,null,null,null,null,null,null,null,null,null,null,null,null,null,null,null,null,null,null,null,null,null,null,null,null,null,null,null,null,null,null,null,null,null,null,"",null,null,null,null,null,null,null,null,null,null,null,null,null,null,null,null,null,null,null,null,null,null,null,null,null,null,null,null,null,null,null,"","","","",null,null,null,null,null,null,null,null,null,null,null,null,null,null,null,null,null,null,null,null,null,null,null,null,null,null,0,0,0,0]
["Malformaciones congénitas y deformidades","Malformaciones congénitas y deformidades",0,0,0,null,null,null,null,null,null,null,null,null,null,null,null,null,null,null,null,null,null,null,null,null,null,null,null,null,null,null,null,null,null,null,null,null,null,null,null,null,null,null,null,null,null,"",null,null,null,null,null,null,null,null,null,null,null,null,null,null,null,null,null,null,null,null,null,null,null,null,null,null,null,null,null,null,null,"","","","",null,null,null,null,null,null,null,null,null,null,null,null,null,null,null,null,null,null,null,null,null,null,null,null,null,null,0,0,0,0]
["Trastornos genéticos  ","Trastornos genéticos  ",0,0,0,null,null,null,null,null,null,null,null,null,null,null,null,null,null,null,null,null,null,null,null,null,null,null,null,null,null,null,null,null,null,null,null,null,null,null,null,null,null,null,null,null,null,"",null,null,null,null,null,null,null,null,null,null,null,null,null,null,null,null,null,null,null,null,null,null,null,null,null,null,null,null,null,null,null,"","","","",null,null,null,null,null,null,null,null,null,null,null,null,null,null,null,null,null,null,null,null,null,null,null,null,null,null,0,0,0,0]
["Prematuros",null,{"$f":"SUM(D162:E162)","v":0},{"$f":"+F162+H162+J162+L162+N162+P162+R162+T162+V162+X162+Z162+AB162+AD162+AF162+AH162+AN162+AP162+AJ162+AL162","v":0},{"$f":"+G162+I162+K162+M162+O162+Q162+S162+U162+W162+Y162+AA162+AC162+AE162+AG162+AI162+AO162+AQ162+AK162+AM162","v":0},null,null,null,null,null,null,null,null,null,null,null,null,null,null,null,null,null,null,null,null,null,null,null,null,null,null,null,null,null,null,null,null,null,null,null,null,null,null,null,null,null,null,"",null,null,null,null,null,null,null,null,null,null,null,null,null,null,null,null,null,null,null,null,null,null,null,null,null,null,null,null,null,null,null,"","","","",null,null,null,null,null,null,null,null,null,null,null,null,null,null,null,null,null,null,null,null,null,null,null,null,null,null,0,0,0,0]
["Enfermedades hematológicas crónicas ","Enfermedades hematológicas crónicas ",{"$f":"SUM(D163:E163)","v":0},{"$f":"+F163+H163+J163+L163+N163+P163+R163+T163+V163+X163+Z163+AB163+AD163+AF163+AH163+AN163+AP163+AJ163+AL163","v":0},0,null,null,null,null,null,null,null,null,null,null,null,null,null,null,null,null,null,null,null,null,null,null,null,null,null,null,null,null,null,null,null,null,null,null,null,null,null,null,null,null,null,null,"",null,null,null,null,null,null,null,null,null,null,null,null,null,null,null,null,null,null,null,null,null,null,null,null,null,null,null,null,null,null,null,"","","","",null,null,null,null,null,null,null,null,null,null,null,null,null,null,null,null,null,null,null,null,null,null,null,null,null,null,0,0,0,0]
["Enfermedades musculoesqueléticas crónicas ","Enfermedades musculoesqueléticas crónicas ",{"$f":"SUM(D164:E164)","v":0},0,0,null,null,null,null,null,null,null,null,null,null,null,null,null,null,null,null,null,null,null,null,null,null,null,null,null,null,null,null,null,null,null,null,null,null,null,null,null,null,null,null,null,null,"",null,null,null,null,null,null,null,null,null,null,null,null,null,null,null,null,null,null,null,null,null,null,null,null,null,null,null,null,null,null,null,"","","","",null,null,null,null,null,null,null,null,null,null,null,null,null,null,null,null,null,null,null,null,null,null,null,null,null,null,0,0,0,0]
["Enfermedades del sistema inmunitario (no incluye asma, ni alergias alimentarias) ","Enfermedades del sistema inmunitario (no incluye asma, ni alergias alimentarias) ",{"$f":"SUM(D165:E165)","v":0},0,0,null,null,null,null,null,null,null,null,null,null,null,null,null,null,null,null,null,null,null,null,null,null,null,null,null,null,null,null,null,null,null,null,null,null,null,null,null,null,null,null,null,null,"",null,null,null,null,null,null,null,null,null,null,null,null,null,null,null,null,null,null,null,null,null,null,null,null,null,null,null,null,null,null,null,"","","","",null,null,null,null,null,null,null,null,null,null,null,null,null,null,null,null,null,null,null,null,null,null,null,null,null,null,0,0,0,0]
["Alergias alimentarias","Alergias alimentarias",{"$f":"SUM(D166:E166)","v":0},0,0,null,null,null,null,null,null,null,null,null,null,null,null,null,null,null,null,null,null,null,null,null,null,null,null,null,null,null,null,null,null,null,null,null,null,null,null,null,null,null,null,null,null,"",null,null,null,null,null,null,null,null,null,null,null,null,null,null,null,null,null,null,null,null,null,null,null,null,null,null,null,null,null,null,null,"","","","",null,null,null,null,null,null,null,null,null,null,null,null,null,null,null,null,null,null,null,null,null,null,null,null,null,null,0,0,0,0]
["Otras Enfermedades endocrinológicas (no incluye Hipotiroidismo, ni Diabetes) ","Otras Enfermedades endocrinológicas (no incluye Hipotiroidismo, ni Diabetes) ",{"$f":"SUM(D167:E167)","v":0},0,0,null,null,null,null,null,null,null,null,null,null,null,null,null,null,null,null,null,null,null,null,null,null,null,null,null,null,null,null,null,null,null,null,null,null,null,null,null,null,null,null,null,null,"",null,null,null,null,null,null,null,null,null,null,null,null,null,null,null,null,null,null,null,null,null,null,null,null,null,null,null,null,null,null,null,"","","","",null,null,null,null,null,null,null,null,null,null,null,null,null,null,null,null,null,null,null,null,null,null,null,null,null,null,0,0,0,0]
["Hipotiroidismo ","Hipotiroidismo ",0,0,0,null,null,null,null,null,null,null,null,null,null,null,null,null,null,null,null,null,null,null,null,null,null,null,null,null,null,null,null,null,null,null,null,null,null,null,null,null,null,null,null,null,null,"",null,null,null,null,null,null,null,null,null,null,null,null,null,null,null,null,null,null,null,null,null,null,null,null,null,null,null,null,null,null,null,"","","","",null,null,null,null,null,null,null,null,null,null,null,null,null,null,null,null,null,null,null,null,null,null,null,null,null,null,0,0,0,0]
["Diabetes tipo I ","Diabetes tipo I ",0,0,0,null,null,null,null,null,null,null,null,null,null,null,null,null,null,null,null,null,null,null,null,null,null,null,null,null,null,null,null,null,null,null,null,null,null,null,null,null,null,null,null,null,null,"",null,null,null,null,null,null,null,null,null,null,null,null,null,null,null,null,null,null,null,null,null,null,null,null,null,null,null,null,null,null,null,"","","","",null,null,null,null,null,null,null,null,null,null,null,null,null,null,null,null,null,null,null,null,null,null,null,null,null,null,0,0,0,0]
["Diabetes tipo II ","Diabetes tipo II ",0,0,0,null,null,null,null,null,null,null,null,null,null,null,null,null,null,null,null,null,null,null,null,null,null,null,null,null,null,null,null,null,null,null,null,null,null,null,null,null,null,null,null,null,null,"",null,null,null,null,null,null,null,null,null,null,null,null,null,null,null,null,null,null,null,null,null,null,null,null,null,null,null,null,null,null,null,"","","","",null,null,null,null,null,null,null,null,null,null,null,null,null,null,null,null,null,null,null,null,null,null,null,null,null,null,0,0,0,0]
["Otros Trastornos del metabolismo ","Otros Trastornos del metabolismo ",{"$f":"SUM(D171:E171)","v":0},{"$f":"+F171+H171+J171+L171+N171+P171+R171+T171+V171+X171+Z171+AB171+AD171+AF171+AH171+AN171+AP171+AJ171+AL171","v":0},0,null,null,null,null,null,null,null,null,null,null,null,null,null,null,null,null,null,null,null,null,null,null,null,null,null,null,null,null,null,null,null,null,null,null,null,null,null,null,null,null,null,null,"",null,null,null,null,null,null,null,null,null,null,null,null,null,null,null,null,null,null,null,null,null,null,null,null,null,null,null,null,null,null,null,"","","","",null,null,null,null,null,null,null,null,null,null,null,null,null,null,null,null,null,null,null,null,null,null,null,null,null,null,0,0,0,0]
["Otras Enfermedades respiratorias crónicas (no incluye Asma, ni Fibrosis Quística) ","Otras Enfermedades respiratorias crónicas (no incluye Asma, ni Fibrosis Quística) ",0,0,0,null,null,null,null,null,null,null,null,null,null,null,null,null,null,null,null,null,null,null,null,null,null,null,null,null,null,null,null,null,null,null,null,null,null,null,null,null,null,null,null,null,null,"",null,null,null,null,null,null,null,null,null,null,null,null,null,null,null,null,null,null,null,null,null,null,null,null,null,null,null,null,null,null,null,"","","","",null,null,null,null,null,null,null,null,null,null,null,null,null,null,null,null,null,null,null,null,null,null,null,null,null,null,0,0,0,0]
["Fibrosis Quística ","Fibrosis Quística ",0,0,0,null,null,null,null,null,null,null,null,null,null,null,null,null,null,null,null,null,null,null,null,null,null,null,null,null,null,null,null,null,null,null,null,null,null,null,null,null,null,null,null,null,null,"",null,null,null,null,null,null,null,null,null,null,null,null,null,null,null,null,null,null,null,null,null,null,null,null,null,null,null,null,null,null,null,"","","","",null,null,null,null,null,null,null,null,null,null,null,null,null,null,null,null,null,null,null,null,null,null,null,null,null,null,0,0,0,0]
["Otras condiciones asociadas a NANEAS ","Otras condiciones asociadas a NANEAS ",0,0,0,null,null,null,null,null,null,null,null,null,null,null,null,null,null,null,null,null,null,null,null,null,null,null,null,null,null,null,null,null,null,null,null,null,null,null,null,null,null,null,null,null,null,"",null,null,null,null,null,null,null,null,null,null,null,null,null,null,null,null,null,null,null,null,null,null,null,null,null,null,null,null,null,null,null,"","","","",null,null,null,null,null,null,null,null,null,null,null,null,null,null,null,null,null,null,null,null,null,null,null,null,null,null,0,0,0,0]
["Hospitalización Domiciliaria  ",null,0,0,0,null,null,null,null,null,null,null,null,null,null,null,null,null,null,null,null,null,null,null,null,null,null,null,null,null,null,null,null,null,null,null,null,null,null,null,null,null,null,null,null,null,null,"",null,null,null,null,null,null,null,null,null,null,null,null,null,null,null,null,null,null,null,null,null,null,null,null,null,null,null,null,null,null,null,"","","","",null,null,null,null,null,null,null,null,null,null,null,null,null,null,null,null,null,null,null,null,null,null,null,null,null,null,0,0,0,0]
["Oxigenoterapia Ambulatoria ","Oxigenoterapia Ambulatoria ",0,0,0,null,null,null,null,null,null,null,null,null,null,null,null,null,null,null,null,null,null,null,null,null,null,null,null,null,null,null,null,null,null,null,null,null,null,null,null,null,null,null,null,null,null,"",null,null,null,null,null,null,null,null,null,null,null,null,null,null,null,null,null,null,null,null,null,null,null,null,null,null,null,null,null,null,null,"","","","",null,null,null,null,null,null,null,null,null,null,null,null,null,null,null,null,null,null,null,null,null,null,null,null,null,null,0,0,0,0]
["Asistencia ventilatoria Invasiva y No invasiva ","Asistencia ventilatoria Invasiva y No invasiva ",0,0,0,null,null,null,null,null,null,null,null,null,null,null,null,null,null,null,null,null,null,null,null,null,null,null,null,null,null,null,null,null,null,null,null,null,null,null,null,null,null,null,null,null,null,"",null,null,null,null,null,null,null,null,null,null,null,null,null,null,null,null,null,null,null,null,null,null,null,null,null,null,null,null,null,null,null,"","","","",null,null,null,null,null,null,null,null,null,null,null,null,null,null,null,null,null,null,null,null,null,null,null,null,null,null,0,0,0,0]
["Errores Innatos del Metabolismo",null,0,0,0,null,null,null,null,null,null,null,null,null,null,null,null,null,null,null,null,null,null,null,null,null,null,null,null,null,null,null,null,null,null,null,null,null,null,null,null,null,null,null,null,null,null,"",null,null,null,null,null,null,null,null,null,null,null,null,null,null,null,null,null,null,null,null,null,null,null,null,null,null,null,null,null,null,null,"","","","",null,null,null,null,null,null,null,null,null,null,null,null,null,null,null,null,null,null,null,null,null,null,null,null,null,null,0,0,0,0]
["Asma","Asma",0,0,0,null,null,null,null,null,null,null,null,null,null,null,null,null,null,null,null,null,null,null,null,null,null,null,null,null,null,null,null,null,null,null,null,null,null,null,null,null,null,null,null,null,null,"",null,null,null,null,null,null,null,null,null,null,null,null,null,null,null,null,null,null,null,null,null,null,null,null,null,null,null,null,null,null,null,"","","","",null,null,null,null,null,null,null,null,null,null,null,null,null,null,null,null,null,null,null,null,null,null,null,null,null,null,0,0,0,0]
["Cardiopatía congénita","Cardiopatía congénita",0,0,0,null,null,null,null,null,null,null,null,null,null,null,null,null,null,null,null,null,null,null,null,null,null,null,null,null,null,null,null,null,null,null,null,null,null,null,null,null,null,null,null,null,null,"",null,null,null,null,null,null,null,null,null,null,null,null,null,null,null,null,null,null,null,null,null,null,null,null,null,null,null,null,null,null,null,"","","","",null,null,null,null,null,null,null,null,null,null,null,null,null,null,null,null,null,null,null,null,null,null,null,null,null,null,0,0,0,0]
["Enfermedad celiaca ","Enfermedad celiaca ",0,0,0,null,null,null,null,null,null,null,null,null,null,null,null,null,null,null,null,null,null,null,null,null,null,null,null,null,null,null,null,null,null,null,null,null,null,null,null,null,null,null,null,null,null,"",null,null,null,null,null,null,null,null,null,null,null,null,null,null,null,null,null,null,null,null,null,null,null,null,null,null,null,null,null,null,null,"","","","",null,null,null,null,null,null,null,null,null,null,null,null,null,null,null,null,null,null,null,null,null,null,null,null,null,null,0,0,0,0]
["Estrabismo ","Estrabismo ",0,0,0,null,null,null,null,null,null,null,null,null,null,null,null,null,null,null,null,null,null,null,null,null,null,null,null,null,null,null,null,null,null,null,null,null,null,null,null,null,null,null,null,null,null,"",null,null,null,null,null,null,null,null,null,null,null,null,null,null,null,null,null,null,null,null,null,null,null,null,null,null,null,null,null,null,null,"","","","",null,null,null,null,null,null,null,null,null,null,null,null,null,null,null,null,null,null,null,null,null,null,null,null,null,null,0,0,0,0]
["Errores de refracción","Errores de refracción",0,0,0,null,null,null,null,null,null,null,null,null,null,null,null,null,null,null,null,null,null,null,null,null,null,null,null,null,null,null,null,null,null,null,null,null,null,null,null,null,null,null,null,null,null,"",null,null,null,null,null,null,null,null,null,null,null,null,null,null,null,null,null,null,null,null,null,null,null,null,null,null,null,null,null,null,null,"","","","",null,null,null,null,null,null,null,null,null,null,null,null,null,null,null,null,null,null,null,null,null,null,null,null,null,null,0,0,0,0]
["Otras Enfermedades crónicas neurológicas (No incluye síndrome de Rett, Paráisis Cerebral, Epilepsia, TEA)","Otras Enfermedades crónicas neurológicas (No incluye síndrome de Rett, Parálisis Cerebral, Epiepsia, TEA)",{"$f":"SUM(D184:E184)","v":0},{"$f":"+F184+H184+J184+L184+N184+P184+R184+T184+V184+X184+Z184+AB184+AD184+AF184+AH184+AN184+AP184+AJ184+AL184","v":0},0,null,null,null,null,null,null,null,null,null,null,null,null,null,null,null,null,null,null,null,null,null,null,null,null,null,null,null,null,null,null,null,null,null,null,null,null,null,null,null,null,null,null,"",null,null,null,null,null,null,null,null,null,null,null,null,null,null,null,null,null,null,null,null,null,null,null,null,null,null,null,null,null,null,null,"","","","",null,null,null,null,null,null,null,null,null,null,null,null,null,null,null,null,null,null,null,null,null,null,null,null,null,null,0,0,0,0]
["Disrrafias espinales","Disrafias espinales",0,0,0,null,null,null,null,null,null,null,null,null,null,null,null,null,null,null,null,null,null,null,null,null,null,null,null,null,null,null,null,null,null,null,null,null,null,null,null,null,null,null,null,null,null,"",null,null,null,null,null,null,null,null,null,null,null,null,null,null,null,null,null,null,null,null,null,null,null,null,null,null,null,null,null,null,null,"","","","",null,null,null,null,null,null,null,null,null,null,null,null,null,null,null,null,null,null,null,null,null,null,null,null,null,null,0,0,0,0]
["Escoliosis","Escoliosis",0,0,0,null,null,null,null,null,null,null,null,null,null,null,null,null,null,null,null,null,null,null,null,null,null,null,null,null,null,null,null,null,null,null,null,null,null,null,null,null,null,null,null,null,null,"",null,null,null,null,null,null,null,null,null,null,null,null,null,null,null,null,null,null,null,null,null,null,null,null,null,null,null,null,null,null,null,"","","","",null,null,null,null,null,null,null,null,null,null,null,null,null,null,null,null,null,null,null,null,null,null,null,null,null,null,0,0,0,0]
["Displasia luxante de caderas","Displasia luxante de caderas",0,0,0,null,null,null,null,null,null,null,null,null,null,null,null,null,null,null,null,null,null,null,null,null,null,null,null,null,null,null,null,null,null,null,null,null,null,null,null,null,null,null,null,null,null,"",null,null,null,null,null,null,null,null,null,null,null,null,null,null,null,null,null,null,null,null,null,null,null,null,null,null,null,null,null,null,null,"","","","",null,null,null,null,null,null,null,null,null,null,null,null,null,null,null,null,null,null,null,null,null,null,null,null,null,null,0,0,0,0]
["Cuidados paliativos","Cuidados paliativos",0,0,{"$f":"+G188+I188+K188+M188+O188+Q188+S188+U188+W188+Y188+AA188+AC188+AE188+AG188+AI188+AO188+AQ188+AK188+AM188","v":0},null,null,null,null,null,null,null,null,null,null,null,null,null,null,null,null,null,null,null,null,null,null,null,null,null,null,null,null,null,null,null,null,null,null,null,null,null,null,null,null,null,null,"",null,null,null,null,null,null,null,null,null,null,null,null,null,null,null,null,null,null,null,null,null,null,null,null,null,null,null,null,null,null,null,"","","","",null,null,null,null,null,null,null,null,null,null,null,null,null,null,null,null,null,null,null,null,null,null,null,null,null,null,0,0,0,0]
["Gran Quemado","Gran Quemado",0,0,0,null,null,null,null,null,null,null,null,null,null,null,null,null,null,null,null,null,null,null,null,null,null,null,null,null,null,null,null,null,null,null,null,null,null,null,null,null,null,null,null,null,null,"",null,null,null,null,null,null,null,null,null,null,null,null,null,null,null,null,null,null,null,null,null,null,null,null,null,null,null,null,null,null,null,"","","","",null,null,null,null,null,null,null,null,null,null,null,null,null,null,null,null,null,null,null,null,null,null,null,null,null,null,0,0,0,0]
["SECCION I: POBLACIÓN SEGÚN NIVEL DE COMPLEJIDAD DE NIÑOS, NIÑAS Y ADOLESCENTES CON NECESIDADES ESPECIALES DE ATENCIÓN EN SALUD (NANEAS) (Incluida en sección A y A1)"]
["NIVELES DE COMPLEJIDAD",null,"TOTAL",null,null,"GRUPOS DE EDAD (en meses - años) Y SEXO",null,null,null,null,null,null,null,null,null,null,null,null,null,null,null,null,null,null,null,null,null,null,null,null,null,null,null,null,null,null,null,null,null,null,null,null,null,"Pueblos Originarios",null," Migrantes"]
[null,null,null,null,null,"Menor de 1 mes",null,"1 mes",null,"2 meses",null,"3 meses",null,"4 meses",null,"5 meses",null,"6 meses",null,"7 a 11 meses",null,"12 a 17 meses",null,"18 a 23 meses",null,"24 a 35 meses",null,"36 a 41 meses",null,"42 a 47 meses",null,"48 a 59 meses",null,"60 a 71 meses",null,"6 a 7 años",null,"8 a 9 años",null,"10 a 14 años",null,"15 a 19 años"]
[null,null,"Ambos sexos","Hombres","Mujeres","Hombres","Mujeres","Hombres","Mujeres","Hombres","Mujeres","Hombres","Mujeres","Hombres","Mujeres","Hombres","Mujeres","Hombres","Mujeres","Hombres","Mujeres","Hombres","Mujeres","Hombres","Mujeres","Hombres","Mujeres","Hombres","Mujeres","Hombres","Mujeres","Hombres","Mujeres","Hombres","Mujeres","Hombres","Mujeres","Hombres","Mujeres","Hombres","Mujeres","Hombres","Mujeres","Hombres","Mujeres","Hombres","Mujeres"]
["TOTAL POBLACIÓN NANEAS BAJO CONTROL",null,{"$f":"SUM(D194:E194)","v":0},{"$f":"+F194+H194+J194+L194+N194+P194+R194+T194+V194+X194+Z194+AB194+AD194+AF194+AH194+AN194+AP194+AJ194+AL194","v":0},{"$f":"+G194+I194+K194+M194+O194+Q194+S194+U194+W194+Y194+AA194+AC194+AE194+AG194+AI194+AO194+AQ194+AK194+AM194","v":0},{"$f":"SUM(F195:F197)","v":0},{"$f":"SUM(G195:G197)","v":0},{"$f":"SUM(H195:H197)","v":0},0,0,0,0,0,0,0,0,0,0,0,0,0,0,0,0,0,0,0,0,0,0,0,0,0,0,0,0,0,0,0,0,0,0,0,{"$f":"SUM(AR195:AR197)","v":0},{"$f":"SUM(AS195:AS197)","v":0},{"$f":"SUM(AT195:AT197)","v":0},{"$f":"SUM(AU195:AU197)","v":0},null,null,null,null,null,null,null,null,null,null,null,null,null,null,null,null,null,null,null,null,null,null,null,null,null,null,null,null,null,null,null,null,null,null,null,null,null,null,null,null,null,null,null,null,null,null,null,null,null,null,null,null,null,null,null,null,null,null,null,null,null,null,{"$f":"IF(AND(D194>0,AR194=\"\"),1,IF(AR194>D194,1,0))","v":0},{"$f":"IF(AND(E194>0,AS194=\"\"),1,IF(AS194>E194,1,0))","v":0},{"$f":"IF(AND(D194>0,AT194=\"\"),1,IF(AT194>D194,1,0))","v":0},{"$f":"IF(AND(E194>0,AU194=\"\"),1,IF(AU194>E194,1,0))","v":0}]
["BAJA COMPLEJIDAD",null,{"$f":"SUM(D195:E195)","v":0},{"$f":"+F195+H195+J195+L195+N195+P195+R195+T195+V195+X195+Z195+AB195+AD195+AF195+AH195+AN195+AP195+AJ195+AL195","v":0},{"$f":"+G195+I195+K195+M195+O195+Q195+S195+U195+W195+Y195+AA195+AC195+AE195+AG195+AI195+AO195+AQ195+AK195+AM195","v":0},null,null,null,null,null,null,null,null,null,null,null,null,null,null,null,null,null,null,null,null,null,null,null,null,null,null,null,null,null,null,null,null,null,null,null,null,null,null,null,null,null,null,{"$f":"CB195&CC195&CD195&CE195","v":""},null,null,null,null,null,null,null,null,null,null,null,null,null,null,null,null,null,null,null,null,null,null,null,null,null,null,null,null,null,null,null,{"$f":"IF(AND(D195>0,AR195=\"\"),\" * No olvide digitar la variable Pueblos Originarios hombres (Digite Cero si no tiene).\",IF(AR195>D195,\" * La variable Pueblos Originarios hombres  no debe ser mayor que el Total de Hombres.\",\"\"))","v":""},{"$f":"IF(AND(E195>0,AS195=\"\"),\" * No olvide digitar la variable Pueblos Originarios Mujeres (Digite Cero si no tiene). Digite Cero si no tiene.\",IF(AS195>E195,\" * La variable Pueblos Originarios Mujeres no debe ser mayor que el Total de Mujeres\",\"\"))","v":""},{"$f":"IF(AND(D195>0,AT195=\"\"),\" * No olvide digitar la variable Migrantes hombres (Digite Cero si no tiene).\",IF(AT195>D195,\" * La variable Migrantes hombres  no debe ser mayor que el Total de Hombres\",\"\"))","v":""},{"$f":"IF(AND(E195>0,AU195=\"\"),\" * No olvide digitar la variable Migrantes Mujeres (Digite Cero si no tiene).\",IF(AU195>E195,\" * La variable Migrantes Mujeres no debe ser mayor que el Total de Mujeres\",\"\"))","v":""},null,null,{"$f":"IF(AND(D195>0,AF195=\"\"),\" * No olvide digitar la variable Niños, Niñas, adolescentes y jóvenes Mejor Niñez hombres (Digite Cero si no tiene).\",IF(AF195>D195,\" * La variable Niños, Niñas, adolescentes y jóvenes Mejor Niñez hombres  no debe ser mayor que el Total de Hombres\",\"\"))","v":""},{"$f":"IF(AND(E195>0,AG195=\"\"),\" * No olvide digitar la variable Niños, Niñas, adolescentes y jóvenes Mejor Niñez Mujeres (Digite Cero si no tiene).\",IF(AG195>E195,\" * La variable Niños, Niñas, adolescentes y jóvenes Mejor Niñez Mujeres no debe ser mayor que el Total de Mujeres\",\"\"))","v":""},null,null,null,null,null,null,null,null,null,null,null,null,null,null,null,null,null,null,null,null,null,null,0,0,0,0]
["MEDIANA COMPLEJIDAD",null,{"$f":"SUM(D196:E196)","v":0},{"$f":"+F196+H196+J196+L196+N196+P196+R196+T196+V196+X196+Z196+AB196+AD196+AF196+AH196+AN196+AP196+AJ196+AL196","v":0},{"$f":"+G196+I196+K196+M196+O196+Q196+S196+U196+W196+Y196+AA196+AC196+AE196+AG196+AI196+AO196+AQ196+AK196+AM196","v":0},null,null,null,null,null,null,null,null,null,null,null,null,null,null,null,null,null,null,null,null,null,null,null,null,null,null,null,null,null,null,null,null,null,null,null,null,null,null,null,null,null,null,{"$f":"CB196&CC196&CD196&CE196","v":""},null,null,null,null,null,null,null,null,null,null,null,null,null,null,null,null,null,null,null,null,null,null,null,null,null,null,null,null,null,null,null,{"$f":"IF(AND(D196>0,AR196=\"\"),\" * No olvide digitar la variable Pueblos Originarios hombres (Digite Cero si no tiene).\",IF(AR196>D196,\" * La variable Pueblos Originarios hombres  no debe ser mayor que el Total de Hombres.\",\"\"))","v":""},{"$f":"IF(AND(E196>0,AS196=\"\"),\" * No olvide digitar la variable Pueblos Originarios Mujeres (Digite Cero si no tiene). Digite Cero si no tiene.\",IF(AS196>E196,\" * La variable Pueblos Originarios Mujeres no debe ser mayor que el Total de Mujeres\",\"\"))","v":""},{"$f":"IF(AND(D196>0,AT196=\"\"),\" * No olvide digitar la variable Migrantes hombres (Digite Cero si no tiene).\",IF(AT196>D196,\" * La variable Migrantes hombres  no debe ser mayor que el Total de Hombres\",\"\"))","v":""},{"$f":"IF(AND(E196>0,AU196=\"\"),\" * No olvide digitar la variable Migrantes Mujeres (Digite Cero si no tiene).\",IF(AU196>E196,\" * La variable Migrantes Mujeres no debe ser mayor que el Total de Mujeres\",\"\"))","v":""},null,null,{"$f":"IF(AND(D196>0,AF196=\"\"),\" * No olvide digitar la variable Niños, Niñas, adolescentes y jóvenes Mejor Niñez hombres (Digite Cero si no tiene).\",IF(AF196>D196,\" * La variable Niños, Niñas, adolescentes y jóvenes Mejor Niñez hombres  no debe ser mayor que el Total de Hombres\",\"\"))","v":""},{"$f":"IF(AND(E196>0,AG196=\"\"),\" * No olvide digitar la variable Niños, Niñas, adolescentes y jóvenes Mejor Niñez Mujeres (Digite Cero si no tiene).\",IF(AG196>E196,\" * La variable Niños, Niñas, adolescentes y jóvenes Mejor Niñez Mujeres no debe ser mayor que el Total de Mujeres\",\"\"))","v":""},null,null,null,null,null,null,null,null,null,null,null,null,null,null,null,null,null,null,null,null,null,null,0,0,0,0]
["ALTA COMPLEJIDAD",null,0,0,0,null,null,null,null,null,null,null,null,null,null,null,null,null,null,null,null,null,null,null,null,null,null,null,null,null,null,null,null,null,null,null,null,null,null,null,null,null,null,null,null,null,null,{"$f":"CB197&CC197&CD197&CE197","v":""},null,null,null,null,null,null,null,null,null,null,null,null,null,null,null,null,null,null,null,null,null,null,null,null,null,null,null,null,null,null,null,"","","",{"$f":"IF(AND(E197>0,AU197=\"\"),\" * No olvide digitar la variable Migrantes Mujeres (Digite Cero si no tiene).\",IF(AU197>E197,\" * La variable Migrantes Mujeres no debe ser mayor que el Total de Mujeres\",\"\"))","v":""},null,null,"","",null,null,null,null,null,null,null,null,null,null,null,null,null,null,null,null,null,null,null,null,null,null,0,0,0,0]
["SECCION J: POBLACIÓN EN CONTROL, SEGÚN RIESGO ODONTOLÓGICO Y DAÑO POR CARIES"]
["INDICADOR ODONTOLÓGICO\nY\nPARÁMETROS DE MEDICIÓN",null,"TOTAL",null,null,"GRUPOS DE EDAD  Y SEXO",null,null,null,null,null,null,null,null,null,null,null,null,null,null,null,null,null,null,null,"Pueblos Originarios",null," Migrantes",null,"Usuarios con Discapacidad",null,"Niños, Niñas, Adolescentes y Jóvenes Mejor Niñez"]
[null,null,null,null,null,"< 1 AÑO",null,"1 AÑO",null,"2 AÑOS",null,"3 AÑOS",null,"4 AÑOS",null,"5 AÑOS",null,"6 AÑOS",null,"7 AÑOS",null,"8 AÑOS",null,"9 AÑOS "]
[null,null,"Ambos sexos","Hombres","Mujeres","Hombres","Mujeres","Hombres","Mujeres","Hombres","Mujeres","Hombres","Mujeres","Hombres","Mujeres","Hombres","Mujeres","Hombres","Mujeres","Hombres","Mujeres","Hombres","Mujeres","Hombres","Mujeres","Hombres","Mujeres","Hombres","Mujeres","Hombres","Mujeres","Hombres","Mujeres"]
["TOTAL DE NIÑOS(AS) EN CONTROL CON ENFOQUE DE RIESGO ODONTOLÓGICO",null,{"$f":"SUM(D202:E202)","v":0},{"$f":"+F202+H202+J202+L202+N202+P202+R202+T202+V202+X202","v":0},{"$f":"+G202+I202+K202+M202+O202+Q202+S202+U202+W202+Y202","v":0},null,null,null,null,null,null,null,null,null,null,null,null,null,null,null,null,null,null,null,null,null,null,null,null,null,null,null,null,{"$f":"CB202&CC202&CD202&CE202&CF202&CG202&CH202&CI202&CJ202&CK202","v":""},null,null,null,null,null,null,null,null,null,null,null,null,null,null,null,null,null,null,null,null,null,null,null,null,null,null,null,null,null,null,null,null,null,null,null,null,null,null,null,null,null,null,null,null,null,{"$f":"IF(AND(D202>0,Z202=\"\"),\" * No olvide digitar la variable Pueblos Originarios hombres (Digite Cero si no tiene).\",IF(Z202>D202,\" * La variable Pueblos Originarios hombres  no debe ser mayor que el Total de Hombres.\",\"\"))","v":""},{"$f":"IF(AND(E202>0,AA202=\"\"),\" * No olvide digitar la variable Pueblos Originarios Mujeres (Digite Cero si no tiene). Digite Cero si no tiene.\",IF(AA202>E202,\" * La variable Pueblos Originarios Mujeres no debe ser mayor que el Total de Mujeres\",\"\"))","v":""},{"$f":"IF(AND(D202>0,AB202=\"\"),\" * No olvide digitar la variable Migrantes hombres (Digite Cero si no tiene).\",IF(AB202>D202,\" * La variable Migrantes hombres  no debe ser mayor que el Total de Hombres\",\"\"))","v":""},{"$f":"IF(AND(E202>0,AC202=\"\"),\" * No olvide digitar la variable Migrantes Mujeres (Digite Cero si no tiene).\",IF(AC202>E202,\" * La variable Migrantes Mujeres no debe ser mayor que el Total de Mujeres\",\"\"))","v":""},{"$f":"IF(AND(D202>0,AD202=\"\"),\" * No olvide digitar la variable Usuarios con Discapacidad hombres (Digite Cero si no tiene).\",IF(AD202>D202,\" * La variable Usuarios con Discapacidad hombres  no debe ser mayor que el Total de Hombres\",\"\"))","v":""},{"$f":"IF(AND(E202>0,AE202=\"\"),\" * No olvide digitar la variable Usuarios con Discapacidad  Mujeres (Digite Cero si no tiene).\",IF(AE202>E202,\" * La variable Usuarios con Discapacidad Mujeres no debe ser mayor que el Total de Mujeres\",\"\"))","v":""},{"$f":"IF(AND(D202>0,AF202=\"\"),\" * No olvide digitar la variable Niños, Niñas, adolescentes y jóvenes Mejor Niñez hombres (Digite Cero si no tiene).\",IF(AF202>D202,\" * La variable Niños, Niñas, adolescentes y jóvenes Mejor Niñez hombres  no debe ser mayor que el Total de Hombres\",\"\"))","v":""},{"$f":"IF(AND(E202>0,AG202=\"\"),\" * No olvide digitar la variable Niños, Niñas, adolescentes y jóvenes Mejor Niñez Mujeres (Digite Cero si no tiene).\",IF(AG202>E202,\" * La variable Niños, Niñas, adolescentes y jóvenes Mejor Niñez Mujeres no debe ser mayor que el Total de Mujeres\",\"\"))","v":""},null,null,null,null,null,null,null,null,null,null,null,null,null,null,null,null,null,null,{"$f":"IF(AND(D202>0,Z202=\"\"),1,IF(Z202>D202,1,0))","v":0},{"$f":"IF(AND(E202>0,AA202=\"\"),1,IF(AA202>E202,1,0))","v":0},{"$f":"IF(AND(D202>0,AB202=\"\"),1,IF(AB202>D202,1,0))","v":0},null,{"$f":"IF(AND(E202>0,AC202=\"\"),1,IF(AC202>E202,1,0))","v":0},{"$f":"IF(AND(D202>0,AD202=\"\"),1,IF(AD202>D202,1,0))","v":0},{"$f":"IF(AND(E202>0,AE202=\"\"),1,IF(AE202>E202,1,0))","v":0},{"$f":"IF(AND(D202>0,AF202=\"\"),1,IF(AF202>D202,1,0))","v":0},{"$f":"IF(AND(E202>0,AG202=\"\"),1,IF(AG202>E202,1,0))","v":0}]
["EVALUACIÓN DE RIESGO SEGÚN PAUTA CERO","ALTO RIESGO ",0,0,{"$f":"+G203+I203+K203+M203+O203+Q203+S203+U203+W203+Y203","v":0},null,null,null,null,null,null,null,null,null,null,null,null,null,null,null,null,null,null,null,null,null,null,null,null,null,null,null,null,{"$f":"CB203&CC203&CD203&CE203&CF203&CG203&CH203&CI203&CJ203&CK203","v":""},null,null,null,null,null,null,null,null,null,null,null,null,null,null,null,null,null,null,null,null,null,null,null,null,null,null,null,null,null,null,null,null,null,null,null,null,null,null,null,null,null,null,null,null,null,{"$f":"IF(AND(D203>0,Z203=\"\"),\" * No olvide digitar la variable Pueblos Originarios hombres (Digite Cero si no tiene).\",IF(Z203>D203,\" * La variable Pueblos Originarios hombres  no debe ser mayor que el Total de Hombres.\",\"\"))","v":""},{"$f":"IF(AND(E203>0,AA203=\"\"),\" * No olvide digitar la variable Pueblos Originarios Mujeres (Digite Cero si no tiene). Digite Cero si no tiene.\",IF(AA203>E203,\" * La variable Pueblos Originarios Mujeres no debe ser mayor que el Total de Mujeres\",\"\"))","v":""},{"$f":"IF(AND(D203>0,AB203=\"\"),\" * No olvide digitar la variable Migrantes hombres (Digite Cero si no tiene).\",IF(AB203>D203,\" * La variable Migrantes hombres  no debe ser mayor que el Total de Hombres\",\"\"))","v":""},{"$f":"IF(AND(E203>0,AC203=\"\"),\" * No olvide digitar la variable Migrantes Mujeres (Digite Cero si no tiene).\",IF(AC203>E203,\" * La variable Migrantes Mujeres no debe ser mayor que el Total de Mujeres\",\"\"))","v":""},{"$f":"IF(AND(D203>0,AD203=\"\"),\" * No olvide digitar la variable Usuarios con Discapacidad hombres (Digite Cero si no tiene).\",IF(AD203>D203,\" * La variable Usuarios con Discapacidad hombres  no debe ser mayor que el Total de Hombres\",\"\"))","v":""},{"$f":"IF(AND(E203>0,AE203=\"\"),\" * No olvide digitar la variable Usuarios con Discapacidad  Mujeres (Digite Cero si no tiene).\",IF(AE203>E203,\" * La variable Usuarios con Discapacidad Mujeres no debe ser mayor que el Total de Mujeres\",\"\"))","v":""},{"$f":"IF(AND(D203>0,AF203=\"\"),\" * No olvide digitar la variable Niños, Niñas, adolescentes y jóvenes Mejor Niñez hombres (Digite Cero si no tiene).\",IF(AF203>D203,\" * La variable Niños, Niñas, adolescentes y jóvenes Mejor Niñez hombres  no debe ser mayor que el Total de Hombres\",\"\"))","v":""},{"$f":"IF(AND(E203>0,AG203=\"\"),\" * No olvide digitar la variable Niños, Niñas, adolescentes y jóvenes Mejor Niñez Mujeres (Digite Cero si no tiene).\",IF(AG203>E203,\" * La variable Niños, Niñas, adolescentes y jóvenes Mejor Niñez Mujeres no debe ser mayor que el Total de Mujeres\",\"\"))","v":""},null,null,null,null,null,null,null,null,null,null,null,null,null,null,null,null,null,null,{"$f":"IF(AND(D203>0,Z203=\"\"),1,IF(Z203>D203,1,0))","v":0},{"$f":"IF(AND(E203>0,AA203=\"\"),1,IF(AA203>E203,1,0))","v":0},{"$f":"IF(AND(D203>0,AB203=\"\"),1,IF(AB203>D203,1,0))","v":0},null,{"$f":"IF(AND(E203>0,AC203=\"\"),1,IF(AC203>E203,1,0))","v":0},{"$f":"IF(AND(D203>0,AD203=\"\"),1,IF(AD203>D203,1,0))","v":0},{"$f":"IF(AND(E203>0,AE203=\"\"),1,IF(AE203>E203,1,0))","v":0},{"$f":"IF(AND(D203>0,AF203=\"\"),1,IF(AF203>D203,1,0))","v":0},{"$f":"IF(AND(E203>0,AG203=\"\"),1,IF(AG203>E203,1,0))","v":0}]
[null,"BAJO RIESGO ",0,0,0,null,null,null,null,null,null,null,null,null,null,null,null,null,null,null,null,null,null,null,null,null,null,null,null,null,null,null,null,{"$f":"CB204&CC204&CD204&CE204&CF204&CG204&CH204&CI204&CJ204&CK204","v":""},null,null,null,null,null,null,null,null,null,null,null,null,null,null,null,null,null,null,null,null,null,null,null,null,null,null,null,null,null,null,null,null,null,null,null,null,null,null,null,null,null,null,null,null,null,"","","","","","","","",null,null,null,null,null,null,null,null,null,null,null,null,null,null,null,null,null,null,0,0,0,null,0,0,0,0,0]
[null,"TOTAL ",{"$f":"SUM(D205:E205)","v":0},{"$f":"+F205+H205+J205+L205+N205+P205+R205+T205+V205+X205","v":0},{"$f":"+G205+I205+K205+M205+O205+Q205+S205+U205+W205+Y205","v":0},{"$f":"SUM(F203:F204)","v":0},{"$f":"SUM(G203:G204)","v":0},0,0,0,0,0,0,0,0,0,0,0,0,0,0,0,0,0,0,0,0,0,0,0,{"$f":"SUM(AE203:AE204)","v":0},0,0,null,null,null,null,null,null,null,null,null,null,null,null,null,null,null,null,null,null,null,null,null,null,null,null,null,null,null,null,null,null,null,null,null,null,null,null,null,null,null,null,null,null,null,null,null,null,null,null,null,null,null,null,null,null,null,null,null,null,null,null,null,null,null,null,null,null,null,null,null,null,null,null,0,0,0,null,0,0,0,0,0]
["EVALUACIÓN DE DAÑO POR CARIES SEGÚN ÍNDICE ceod O COPD",0,{"$f":"SUM(D206:E206)","v":0},{"$f":"+F206+H206+J206+L206+N206+P206+R206+T206+V206+X206","v":0},{"$f":"+G206+I206+K206+M206+O206+Q206+S206+U206+W206+Y206","v":0},null,null,null,null,null,null,null,null,null,null,null,null,null,null,null,null,null,null,null,null,null,null,null,null,null,null,null,null,{"$f":"CB206&CC206&CD206&CE206&CF206&CG206&CH206&CI206&CJ206&CK206","v":""},null,null,null,null,null,null,null,null,null,null,null,null,null,null,null,null,null,null,null,null,null,null,null,null,null,null,null,null,null,null,null,null,null,null,null,null,null,null,null,null,null,null,null,null,null,{"$f":"IF(AND(D206>0,Z206=\"\"),\" * No olvide digitar la variable Pueblos Originarios hombres (Digite Cero si no tiene).\",IF(Z206>D206,\" * La variable Pueblos Originarios hombres  no debe ser mayor que el Total de Hombres.\",\"\"))","v":""},{"$f":"IF(AND(E206>0,AA206=\"\"),\" * No olvide digitar la variable Pueblos Originarios Mujeres (Digite Cero si no tiene). Digite Cero si no tiene.\",IF(AA206>E206,\" * La variable Pueblos Originarios Mujeres no debe ser mayor que el Total de Mujeres\",\"\"))","v":""},{"$f":"IF(AND(D206>0,AB206=\"\"),\" * No olvide digitar la variable Migrantes hombres (Digite Cero si no tiene).\",IF(AB206>D206,\" * La variable Migrantes hombres  no debe ser mayor que el Total de Hombres\",\"\"))","v":""},{"$f":"IF(AND(E206>0,AC206=\"\"),\" * No olvide digitar la variable Migrantes Mujeres (Digite Cero si no tiene).\",IF(AC206>E206,\" * La variable Migrantes Mujeres no debe ser mayor que el Total de Mujeres\",\"\"))","v":""},{"$f":"IF(AND(D206>0,AD206=\"\"),\" * No olvide digitar la variable Usuarios con Discapacidad hombres (Digite Cero si no tiene).\",IF(AD206>D206,\" * La variable Usuarios con Discapacidad hombres  no debe ser mayor que el Total de Hombres\",\"\"))","v":""},{"$f":"IF(AND(E206>0,AE206=\"\"),\" * No olvide digitar la variable Usuarios con Discapacidad  Mujeres (Digite Cero si no tiene).\",IF(AE206>E206,\" * La variable Usuarios con Discapacidad Mujeres no debe ser mayor que el Total de Mujeres\",\"\"))","v":""},{"$f":"IF(AND(D206>0,AF206=\"\"),\" * No olvide digitar la variable Niños, Niñas, adolescentes y jóvenes Mejor Niñez hombres (Digite Cero si no tiene).\",IF(AF206>D206,\" * La variable Niños, Niñas, adolescentes y jóvenes Mejor Niñez hombres  no debe ser mayor que el Total de Hombres\",\"\"))","v":""},{"$f":"IF(AND(E206>0,AG206=\"\"),\" * No olvide digitar la variable Niños, Niñas, adolescentes y jóvenes Mejor Niñez Mujeres (Digite Cero si no tiene).\",IF(AG206>E206,\" * La variable Niños, Niñas, adolescentes y jóvenes Mejor Niñez Mujeres no debe ser mayor que el Total de Mujeres\",\"\"))","v":""},null,null,null,null,null,null,null,null,null,null,null,null,null,null,null,null,null,null,0,0,0,null,0,0,0,0,0]
[null,"1 a 2",0,0,0,null,null,null,null,null,null,null,null,null,null,null,null,null,null,null,null,null,null,null,null,null,null,null,null,null,null,null,null,"",null,null,null,null,null,null,null,null,null,null,null,null,null,null,null,null,null,null,null,null,null,null,null,null,null,null,null,null,null,null,null,null,null,null,null,null,null,null,null,null,null,null,null,null,null,"","","","","","","","",null,null,null,null,null,null,null,null,null,null,null,null,null,null,null,null,null,null,0,0,0,null,0,0,0,0,0]
[null,"3 a 4",0,0,0,null,null,null,null,null,null,null,null,null,null,null,null,null,null,null,null,null,null,null,null,null,null,null,null,null,null,null,null,"",null,null,null,null,null,null,null,null,null,null,null,null,null,null,null,null,null,null,null,null,null,null,null,null,null,null,null,null,null,null,null,null,null,null,null,null,null,null,null,null,null,null,null,null,null,"","","","","","","","",null,null,null,null,null,null,null,null,null,null,null,null,null,null,null,null,null,null,0,0,0,null,0,0,0,0,0]
[null,"5 a 6",0,0,0,null,null,null,null,null,null,null,null,null,null,null,null,null,null,null,null,null,null,null,null,null,null,null,null,null,null,null,null,"",null,null,null,null,null,null,null,null,null,null,null,null,null,null,null,null,null,null,null,null,null,null,null,null,null,null,null,null,null,null,null,null,null,null,null,null,null,null,null,null,null,null,null,null,null,"","","","","","","","",null,null,null,null,null,null,null,null,null,null,null,null,null,null,null,null,null,null,0,0,0,null,0,0,0,0,0]
[null,"7 a 8",0,0,0,null,null,null,null,null,null,null,null,null,null,null,null,null,null,null,null,null,null,null,null,null,null,null,null,null,null,null,null,"",null,null,null,null,null,null,null,null,null,null,null,null,null,null,null,null,null,null,null,null,null,null,null,null,null,null,null,null,null,null,null,null,null,null,null,null,null,null,null,null,null,null,null,null,null,"","","","","","","","",null,null,null,null,null,null,null,null,null,null,null,null,null,null,null,null,null,null,0,0,0,null,0,0,0,0,0]
[null,"9 o más",0,0,0,null,null,null,null,null,null,null,null,null,null,null,null,null,null,null,null,null,null,null,null,null,null,null,null,null,null,null,null,"",null,null,null,null,null,null,null,null,null,null,null,null,null,null,null,null,null,null,null,null,null,null,null,null,null,null,null,null,null,null,null,null,null,null,null,null,null,null,null,null,null,null,null,null,null,"","","","","","","","",null,null,null,null,null,null,null,null,null,null,null,null,null,null,null,null,null,null,0,0,0,null,0,0,0,0,0]
[null,"TOTAL ",0,0,0,{"$f":"SUM(F206:F211)","v":0},{"$f":"SUM(G206:G211)","v":0},0,0,0,0,0,0,0,0,0,0,0,0,0,0,0,0,0,0,0,0,0,0,0,0,0,0,null,null,null,null,null,null,null,null,null,null,null,null,null,null,null,null,null,null,null,null,null,null,null,null,null,null,null,null,null,null,null,null,null,null,null,null,null,null,null,null,null,null,null,null,null,null,null,null,null,null,null,null,null,null,null,null,null,null,null,null,null,null,null,null,null,null,null,null,null,null,null,null,0,0,0,null,0,0,0,0,0]
["INASISTENTES A CONTROL ODONTOLÓGICO",null,{"$f":"SUM(D213:E213)","v":0},0,0,null,null,null,null,null,null,null,null,null,null,null,null,null,null,null,null,null,null,null,null,null,null,null,null,null,null,null,null,{"$f":"CB213&CC213&CD213&CE213&CF213&CG213&CH213&CI213&CJ213&CK213","v":""},null,null,null,null,null,null,null,null,null,null,null,null,null,null,null,null,null,null,null,null,null,null,null,null,null,null,null,null,null,null,null,null,null,null,null,null,null,null,null,null,null,null,null,null,null,{"$f":"IF(AND(D213>0,Z213=\"\"),\" * No olvide digitar la variable Pueblos Originarios hombres (Digite Cero si no tiene).\",IF(Z213>D213,\" * La variable Pueblos Originarios hombres  no debe ser mayor que el Total de Hombres.\",\"\"))","v":""},{"$f":"IF(AND(E213>0,AA213=\"\"),\" * No olvide digitar la variable Pueblos Originarios Mujeres (Digite Cero si no tiene). Digite Cero si no tiene.\",IF(AA213>E213,\" * La variable Pueblos Originarios Mujeres no debe ser mayor que el Total de Mujeres\",\"\"))","v":""},{"$f":"IF(AND(D213>0,AB213=\"\"),\" * No olvide digitar la variable Migrantes hombres (Digite Cero si no tiene).\",IF(AB213>D213,\" * La variable Migrantes hombres  no debe ser mayor que el Total de Hombres\",\"\"))","v":""},{"$f":"IF(AND(E213>0,AC213=\"\"),\" * No olvide digitar la variable Migrantes Mujeres (Digite Cero si no tiene).\",IF(AC213>E213,\" * La variable Migrantes Mujeres no debe ser mayor que el Total de Mujeres\",\"\"))","v":""},{"$f":"IF(AND(D213>0,AD213=\"\"),\" * No olvide digitar la variable Usuarios con Discapacidad hombres (Digite Cero si no tiene).\",IF(AD213>D213,\" * La variable Usuarios con Discapacidad hombres  no debe ser mayor que el Total de Hombres\",\"\"))","v":""},{"$f":"IF(AND(E213>0,AE213=\"\"),\" * No olvide digitar la variable Usuarios con Discapacidad  Mujeres (Digite Cero si no tiene).\",IF(AE213>E213,\" * La variable Usuarios con Discapacidad Mujeres no debe ser mayor que el Total de Mujeres\",\"\"))","v":""},{"$f":"IF(AND(D213>0,AF213=\"\"),\" * No olvide digitar la variable Niños, Niñas, adolescentes y jóvenes Mejor Niñez hombres (Digite Cero si no tiene).\",IF(AF213>D213,\" * La variable Niños, Niñas, adolescentes y jóvenes Mejor Niñez hombres  no debe ser mayor que el Total de Hombres\",\"\"))","v":""},{"$f":"IF(AND(E213>0,AG213=\"\"),\" * No olvide digitar la variable Niños, Niñas, adolescentes y jóvenes Mejor Niñez Mujeres (Digite Cero si no tiene).\",IF(AG213>E213,\" * La variable Niños, Niñas, adolescentes y jóvenes Mejor Niñez Mujeres no debe ser mayor que el Total de Mujeres\",\"\"))","v":""},null,null,null,null,null,null,null,null,null,null,null,null,null,null,null,null,null,null,0,0,0,null,0,0,0,0,0]
[]
[]
[]
[]
[]
[{"$f":"SUM(C11:C39,C44:C73,C77:C104,C108:C111,C115:C116,C125,C134,C140,C145:C189,C194,C202,C205,C212,C213)","v":0},"datos"]
[{"$f":"SUM(DB$11:DV213)","v":0},"errores"]

{"sheet":"P3","index":3,"n_rows":88,"n_cols":96,"rows_kept":88,"cut":false,"hidden":false,"merged":[[8,42,9,43],[48,5,48,6],[56,23,56,24],[56,25,56,26],[56,35,56,36],[56,37,56,38],[48,17,48,18],[56,21,56,22],[48,31,48,32],[48,33,48,34],[8,39,10,39],[9,7,9,8],[9,9,9,10],[9,11,9,12],[9,13,9,14],[9,31,9,32],[9,33,9,34],[8,5,8,38],[9,35,9,36],[9,17,9,18],[9,37,9,38],[9,15,9,16],[9,29,9,30],[9,25,9,26],[48,11,48,12],[54,0,54,38],[48,9,48,10],[62,0,64,0],[56,27,56,28],[56,29,56,30],[56,7,56,8],[56,9,56,10],[56,11,56,12],[56,13,56,14],[56,15,56,16],[56,17,56,18],[56,19,56,20],[58,0,61,0],[56,5,56,6],[48,7,48,8],[56,31,56,32],[56,33,56,34],[55,0,57,1],[55,2,56,4],[55,5,55,38],[48,29,48,30],[47,2,48,4],[11,0,13,0],[14,0,16,0],[17,0,18,0],[25,0,25,1],[30,0,30,1],[20,0,20,1],[34,0,40,0],[43,3,44,3],[28,0,28,1],[29,0,29,1],[21,0,21,1],[22,0,22,1],[23,0,23,1],[31,0,33,0],[26,0,26,1],[27,0,27,1],[42,0,42,41],[43,4,43,10],[43,1,44,1],[43,2,44,2],[67,35,67,36],[8,40,9,41],[66,1,68,1],[66,2,67,4],[6,0,6,24],[8,0,10,1],[8,2,9,4],[9,19,9,20],[9,5,9,6],[9,23,9,24],[9,21,9,22],[46,0,46,38],[48,13,48,14],[48,35,48,36],[48,23,48,24],[48,19,48,20],[48,21,48,22],[48,25,48,26],[48,15,48,16],[48,37,48,38],[47,5,47,38],[48,27,48,28],[9,27,9,28],[19,0,19,1],[66,0,68,0],[69,0,71,0],[72,0,74,0],[75,0,77,0],[47,0,49,1],[50,0,53,0],[43,0,44,0],[66,5,66,38],[67,37,67,38],[67,17,67,18],[67,19,67,20],[67,5,67,6],[67,7,67,8],[67,9,67,10],[67,11,67,12],[67,13,67,14],[67,15,67,16],[67,21,67,22],[67,23,67,24],[67,25,67,26],[67,27,67,28],[67,29,67,30],[67,31,67,32],[67,33,67,34]]}
["DATOS DEL ESTABLECIMIENTO"]
[{"$f":"CONCATENATE(\"COMUNA: \",NOMBRE!$B$2,\" - \",\"( \",NOMBRE!$C$2,NOMBRE!$D$2,NOMBRE!$E$2,NOMBRE!$F$2,NOMBRE!$G$2,\" )\")","v":"COMUNA:  - (  )"}]
[{"$f":"CONCATENATE(\"ESTABLECIMIENTO/ESTRATEGIA: \",NOMBRE!$B$3,\" - \",\"( \",NOMBRE!$C$3,NOMBRE!$D$3,NOMBRE!$E$3,NOMBRE!$F$3,NOMBRE!$G$3,NOMBRE!$H$3,\" )\")","v":"ESTABLECIMIENTO/ESTRATEGIA:  - (  )"}]
[{"$f":"CONCATENATE(\"MES: \",NOMBRE!$B$6,\" - \",\"( \",NOMBRE!$C$6,NOMBRE!$D$6,\" )\")","v":"MES:  - (  )"}]
[{"$f":"CONCATENATE(\"AÑO: \",NOMBRE!$B$7)","v":"AÑO: 2024"}]
[]
["REM-P3. POBLACIÓN EN CONTROL OTROS PROGRAMAS"]
["SECCIÓN A: EXISTENCIA DE POBLACIÓN EN CONTROL"]
["PROGRAMAS",null,"TOTAL",null,null,"GRUPOS DE EDAD (en años) Y SEXO",null,null,null,null,null,null,null,null,null,null,null,null,null,null,null,null,null,null,null,null,null,null,null,null,null,null,null,null,null,null,null,null,null,"Con espirometría vigente","Pueblos Originarios",null,"Migrantes"]
[null,null,null,null,null,"0 a 4 años",null,"5 a 9 años",null,"10 a 14 años",null,"15 a 19 años",null,"20 a 24 años",null,"25 a 29 años",null,"30 a 34 años",null,"35 a 39 años",null,"40 a 44 años",null,"45 a 49 años",null,"50 a 54 años",null,"55 a 59 años",null,"60 a 64 años",null,"65 a 69 años",null,"70 a 74 años",null,"75 a 79 años",null,"80 y más años"]
[null,null,"Ambos\nsexos","Hombres","Mujeres","Hombres","Mujeres","Hombres","Mujeres","Hombres","Mujeres","Hombres","Mujeres","Hombres","Mujeres","Hombres","Mujeres","Hombres","Mujeres","Hombres","Mujeres","Hombres","Mujeres","Hombres","Mujeres","Hombres","Mujeres","Hombres","Mujeres","Hombres","Mujeres","Hombres ","Mujeres","Hombres ","Mujeres","Hombres ","Mujeres","Hombres ","Mujeres",null,"Hombres ","Mujeres","Hombres ","Mujeres"]
["SÍNDROME BRONQUIAL OBSTRUCTIVA RECURRENTE (SBOR)","LEVE",{"$f":"SUM(D12:E12)","v":0},{"$f":"+F12","v":0},{"$f":"+G12","v":0},null,null,null,null,null,null,null,null,null,null,null,null,null,null,null,null,null,null,null,null,null,null,null,null,null,null,null,null,null,null,null,null,null,null,null,null,null,null,null,{"$f":"CA12&CB12&CC12&CD12&CE12&CF12&CG12&CH12","v":""},null,null,null,null,null,null,null,null,null,null,null,null,null,null,null,null,null,null,null,null,null,null,null,null,null,null,null,null,null,null,null,null,null,{"$f":"IF($AN12<=C12,\"\",\"* La Población bajo control con Espirometría Vigente no debe ser mayor al Total de la Existencia de Población en Control. \")","v":""},{"$f":"IF(AND(D12>0,OR(AO12=\"\")),\" * No olvide digitar la variable Pueblos Originarios Hombres (Digite Cero si no tiene).\",IF(AO12>D12,\" * La variable Pueblos Originarios Hombres no puede ser Mayor al Total Hombres.\",\"\"))","v":""},{"$f":"IF(AND(E12>0,OR(AP12=\"\")),\" * No olvide digitar la variable Pueblos Originarios Mujeres (Digite Cero si no tiene).\",IF(AP12>E12,\" * La variable Pueblos Originarios Mujeres no puede ser Mayor al Total Mujeres.\",\"\"))","v":""},{"$f":"IF(AND($D12>0,OR(AQ12=\"\")),\" * No olvide digitar la variable Migrantes Hombres (Digite Cero si no tiene).\",IF(AQ12>$D12,\" * La variable Migrantes Hombres no puede ser Mayor al Total Hombres.\",\"\"))","v":""},{"$f":"IF(AND(E12>0,OR(AR12=\"\")),\" * No olvide digitar la variable Migrantes Mujeres (Digite Cero si no tiene).\",IF(AR12>E12,\" * La variable Migrantes Mujeres no puede ser Mayor al Total Mujeres.\",\"\"))","v":""},null,null,null,{"$f":"IF($AN12<=$C12,0,1)","v":0},{"$f":"IF($D12>=$AO12,0,1)","v":0},{"$f":"IF($E12>=$AP12,0,1)","v":0},{"$f":"IF($D12>=$AQ12,0,1)","v":0},{"$f":"IF($E12>=$AR12,0,1)","v":0},{"$f":"IF(AND($D12<>0,AO12=\"\"),1,0)","v":0},{"$f":"IF(AND($E12<>0,AP12=\"\"),1,0)","v":0},{"$f":"IF(AND($D12<>0,AQ12=\"\"),1,0)","v":0},{"$f":"IF(AND($E12<>0,AR12=\"\"),1,0)","v":0}]
[null,"MODERADO",{"$f":"SUM(D13:E13)","v":0},{"$f":"+F13","v":0},{"$f":"+G13","v":0},null,null,null,null,null,null,null,null,null,null,null,null,null,null,null,null,null,null,null,null,null,null,null,null,null,null,null,null,null,null,null,null,null,null,null,null,null,null,null,{"$f":"CA13&CB13&CC13&CD13&CE13&CF13&CG13&CH13","v":""},null,null,null,null,null,null,null,null,null,null,null,null,null,null,null,null,null,null,null,null,null,null,null,null,null,null,null,null,null,null,null,null,null,{"$f":"IF($AN13<=C13,\"\",\"* La Población bajo control con Espirometría Vigente no debe ser mayor al Total de la Existencia de Población en Control. \")","v":""},{"$f":"IF(AND(D13>0,OR(AO13=\"\")),\" * No olvide digitar la variable Pueblos Originarios Hombres (Digite Cero si no tiene).\",IF(AO13>D13,\" * La variable Pueblos Originarios Hombres no puede ser Mayor al Total Hombres.\",\"\"))","v":""},{"$f":"IF(AND(E13>0,OR(AP13=\"\")),\" * No olvide digitar la variable Pueblos Originarios Mujeres (Digite Cero si no tiene).\",IF(AP13>E13,\" * La variable Pueblos Originarios Mujeres no puede ser Mayor al Total Mujeres.\",\"\"))","v":""},{"$f":"IF(AND($D13>0,OR(AQ13=\"\")),\" * No olvide digitar la variable Migrantes Hombres (Digite Cero si no tiene).\",IF(AQ13>$D13,\" * La variable Migrantes Hombres no puede ser Mayor al Total Hombres.\",\"\"))","v":""},{"$f":"IF(AND(E13>0,OR(AR13=\"\")),\" * No olvide digitar la variable Migrantes Mujeres (Digite Cero si no tiene).\",IF(AR13>E13,\" * La variable Migrantes Mujeres no puede ser Mayor al Total Mujeres.\",\"\"))","v":""},null,null,null,{"$f":"IF($AN13<=$C13,0,1)","v":0},{"$f":"IF($D13>=$AO13,0,1)","v":0},{"$f":"IF($E13>=$AP13,0,1)","v":0},{"$f":"IF($D13>=$AQ13,0,1)","v":0},{"$f":"IF($E13>=$AR13,0,1)","v":0},{"$f":"IF(AND($D13<>0,AO13=\"\"),1,0)","v":0},{"$f":"IF(AND($E13<>0,AP13=\"\"),1,0)","v":0},{"$f":"IF(AND($D13<>0,AQ13=\"\"),1,0)","v":0},{"$f":"IF(AND($E13<>0,AR13=\"\"),1,0)","v":0}]
[null,"SEVERO",0,0,0,null,null,null,null,null,null,null,null,null,null,null,null,null,null,null,null,null,null,null,null,null,null,null,null,null,null,null,null,null,null,null,null,null,null,null,null,null,null,null,"",null,null,null,null,null,null,null,null,null,null,null,null,null,null,null,null,null,null,null,null,null,null,null,null,null,null,null,null,null,null,null,null,null,"","","","","",null,null,null,0,0,0,0,0,0,0,0,0]
["ASMA BRONQUIAL","LEVE",0,{"$f":"+F15+H15+J15+L15+N15+P15+R15+T15+V15+X15+Z15+AB15+AD15+AF15+AH15+AJ15+AL15","v":0},{"$f":"+G15+I15+K15+M15+O15+Q15+S15+U15+W15+Y15+AA15+AC15+AE15+AG15+AI15+AK15+AM15","v":0},null,null,null,null,null,null,null,null,null,null,null,null,null,null,null,null,null,null,null,null,null,null,null,null,null,null,null,null,null,null,null,null,null,null,null,null,null,null,null,"",null,null,null,null,null,null,null,null,null,null,null,null,null,null,null,null,null,null,null,null,null,null,null,null,null,null,null,null,null,null,null,null,null,"","","","","",null,null,null,0,0,0,0,0,0,0,0,0]
[null,"MODERADO",0,{"$f":"+F16+H16+J16+L16+N16+P16+R16+T16+V16+X16+Z16+AB16+AD16+AF16+AH16+AJ16+AL16","v":0},0,null,null,null,null,null,null,null,null,null,null,null,null,null,null,null,null,null,null,null,null,null,null,null,null,null,null,null,null,null,null,null,null,null,null,null,null,null,null,null,"",null,null,null,null,null,null,null,null,null,null,null,null,null,null,null,null,null,null,null,null,null,null,null,null,null,null,null,null,null,null,null,null,null,"","","","","",null,null,null,0,0,0,0,0,0,0,0,0]
[null,"SEVERO",0,0,0,null,null,null,null,null,null,null,null,null,null,null,null,null,null,null,null,null,null,null,null,null,null,null,null,null,null,null,null,null,null,null,null,null,null,null,null,null,null,null,"",null,null,null,null,null,null,null,null,null,null,null,null,null,null,null,null,null,null,null,null,null,null,null,null,null,null,null,null,null,null,null,null,null,"","","","","",null,null,null,0,0,0,0,0,0,0,0,0]
["ENFERMEDAD PULMONAR OBSTRUCTIVA CRÓNICA (EPOC)","TIPO A",{"$f":"SUM(D18:E18)","v":0},{"$f":"+V18+X18+Z18+AB18+AD18+AF18+AH18+AJ18+AL18","v":0},{"$f":"+W18+Y18+AA18+AC18+AE18+AG18+AI18+AK18+AM18","v":0},null,null,null,null,null,null,null,null,null,null,null,null,null,null,null,null,null,null,null,null,null,null,null,null,null,null,null,null,null,null,null,null,null,null,null,null,null,null,null,"",null,null,null,null,null,null,null,null,null,null,null,null,null,null,null,null,null,null,null,null,null,null,null,null,null,null,null,null,null,null,null,null,null,"","","","","",null,null,null,0,0,0,0,0,0,0,0,0]
[null,"TIPO B",{"$f":"SUM(D19:E19)","v":0},{"$f":"+V19+X19+Z19+AB19+AD19+AF19+AH19+AJ19+AL19","v":0},{"$f":"+W19+Y19+AA19+AC19+AE19+AG19+AI19+AK19+AM19","v":0},null,null,null,null,null,null,null,null,null,null,null,null,null,null,null,null,null,null,null,null,null,null,null,null,null,null,null,null,null,null,null,null,null,null,null,null,null,null,null,"",null,null,null,null,null,null,null,null,null,null,null,null,null,null,null,null,null,null,null,null,null,null,null,null,null,null,null,null,null,null,null,null,null,{"$f":"IF($AN19<=C19,\"\",\"* La Población bajo control con Espirometría Vigente no debe ser mayor al Total de la Existencia de Población en Control. \")","v":""},"","","","",null,null,null,0,0,0,0,0,0,0,0,0]
["OTRAS RESPIRATORIAS CRONICAS",null,0,{"$f":"+F20+H20+J20+L20+N20+P20+R20+T20+V20+X20+Z20+AB20+AD20+AF20+AH20+AJ20+AL20","v":0},{"$f":"+G20+I20+K20+M20+O20+Q20+S20+U20+W20+Y20+AA20+AC20+AE20+AG20+AI20+AK20+AM20","v":0},null,null,null,null,null,null,null,null,null,null,null,null,null,null,null,null,null,null,null,null,null,null,null,null,null,null,null,null,null,null,null,null,null,null,null,null,null,null,null,"",null,null,null,null,null,null,null,null,null,null,null,null,null,null,null,null,null,null,null,null,null,null,null,null,null,null,null,null,null,null,null,null,null,null,"","","","",null,null,null,null,0,0,0,0,0,0,0,0]
["OXIGENO DEPENDIENTE",null,0,{"$f":"+F21+H21+J21+L21+N21+P21+R21+T21+V21+X21+Z21+AB21+AD21+AF21+AH21+AJ21+AL21","v":0},{"$f":"+G21+I21+K21+M21+O21+Q21+S21+U21+W21+Y21+AA21+AC21+AE21+AG21+AI21+AK21+AM21","v":0},null,null,null,null,null,null,null,null,null,null,null,null,null,null,null,null,null,null,null,null,null,null,null,null,null,null,null,null,null,null,null,null,null,null,null,null,null,null,null,"",null,null,null,null,null,null,null,null,null,null,null,null,null,null,null,null,null,null,null,null,null,null,null,null,null,null,null,null,null,null,null,null,null,null,"","","","",null,null,null,null,0,0,0,0,0,0,0,0]
["ASISTENCIA VENTILATORIA NO INVASIVA O INVASIVA ",null,{"$f":"SUM(D22:E22)","v":0},0,0,null,null,null,null,null,null,null,null,null,null,null,null,null,null,null,null,null,null,null,null,null,null,null,null,null,null,null,null,null,null,null,null,null,null,null,null,null,null,null,"",null,null,null,null,null,null,null,null,null,null,null,null,null,null,null,null,null,null,null,null,null,null,null,null,null,null,null,null,null,null,null,null,null,null,"","","","",null,null,null,null,0,0,0,0,0,0,0,0]
["FIBROSIS QUÍSTICA ",null,{"$f":"SUM(D23:E23)","v":0},{"$f":"+F23+H23+J23+L23+N23+P23+R23+T23+V23+X23+Z23+AB23+AD23","v":0},{"$f":"+G23+I23+K23+M23+O23+Q23+S23+U23+W23+Y23+AA23+AC23+AE23","v":0},null,null,null,null,null,null,null,null,null,null,null,null,null,null,null,null,null,null,null,null,null,null,null,null,null,null,null,null,null,null,null,null,null,null,null,null,null,null,null,"",null,null,null,null,null,null,null,null,null,null,null,null,null,null,null,null,null,null,null,null,null,null,null,null,null,null,null,null,null,null,null,null,null,null,"","","","",null,null,null,null,0,0,0,0,0,0,0,0]
["EPILEPSIA ",null,0,{"$f":"+F24+H24+J24+L24+N24+P24+R24+T24+V24+X24+Z24+AB24+AD24+AF24+AH24+AJ24+AL24","v":0},{"$f":"+G24+I24+K24+M24+O24+Q24+S24+U24+W24+Y24+AA24+AC24+AE24+AG24+AI24+AK24+AM24","v":0},null,null,null,null,null,null,null,null,null,null,null,null,null,null,null,null,null,null,null,null,null,null,null,null,null,null,null,null,null,null,null,null,null,null,null,null,null,null,null,"",null,null,null,null,null,null,null,null,null,null,null,null,null,null,null,null,null,null,null,null,null,null,null,null,null,null,null,null,null,null,null,null,null,null,"","","","",null,null,null,null,0,0,0,0,0,0,0,0]
["GLAUCOMA",null,0,{"$f":"+F25+H25+J25+L25+N25+P25+R25+T25+V25+X25+Z25+AB25+AD25+AF25+AH25+AJ25+AL25","v":0},0,null,null,null,null,null,null,null,null,null,null,null,null,null,null,null,null,null,null,null,null,null,null,null,null,null,null,null,null,null,null,null,null,null,null,null,null,null,null,null,"",null,null,null,null,null,null,null,null,null,null,null,null,null,null,null,null,null,null,null,null,null,null,null,null,null,null,null,null,null,null,null,null,null,null,"","","","",null,null,null,null,0,0,0,0,0,0,0,0]
["ENFERMEDAD DE PARKINSON ",null,0,0,0,null,null,null,null,null,null,null,null,null,null,null,null,null,null,null,null,null,null,null,null,null,null,null,null,null,null,null,null,null,null,null,null,null,null,null,null,null,null,null,"",null,null,null,null,null,null,null,null,null,null,null,null,null,null,null,null,null,null,null,null,null,null,null,null,null,null,null,null,null,null,null,null,null,null,"","","","",null,null,null,null,0,0,0,0,0,0,0,0]
["ARTROSIS DE CADERA Y RODILLA ",null,0,0,0,null,null,null,null,null,null,null,null,null,null,null,null,null,null,null,null,null,null,null,null,null,null,null,null,null,null,null,null,null,null,null,null,null,null,null,null,null,null,null,"",null,null,null,null,null,null,null,null,null,null,null,null,null,null,null,null,null,null,null,null,null,null,null,null,null,null,null,null,null,null,null,null,null,null,"","","","",null,null,null,null,0,0,0,0,0,0,0,0]
["ALIVIO DEL DOLOR",null,0,0,0,null,null,null,null,null,null,null,null,null,null,null,null,null,null,null,null,null,null,null,null,null,null,null,null,null,null,null,null,null,null,null,null,null,null,null,null,null,null,null,"",null,null,null,null,null,null,null,null,null,null,null,null,null,null,null,null,null,null,null,null,null,null,null,null,null,null,null,null,null,null,null,null,null,null,"","","","",null,null,null,null,0,0,0,0,0,0,0,0]
["HIPOTIROIDISMO",null,0,0,0,null,null,null,null,null,null,null,null,null,null,null,null,null,null,null,null,null,null,null,null,null,null,null,null,null,null,null,null,null,null,null,null,null,null,null,null,null,null,null,"",null,null,null,null,null,null,null,null,null,null,null,null,null,null,null,null,null,null,null,null,null,null,null,null,null,null,null,null,null,null,null,null,null,null,"","","","",null,null,null,null,0,0,0,0,0,0,0,0]
["DEPENDENCIA LEVE",null,0,0,0,null,null,null,null,null,null,null,null,null,null,null,null,null,null,null,null,null,null,null,null,null,null,null,null,null,null,null,null,null,null,null,null,null,null,null,null,null,null,null,"",null,null,null,null,null,null,null,null,null,null,null,null,null,null,null,null,null,null,null,null,null,null,null,null,null,null,null,null,null,null,null,null,null,null,"","","","",null,null,null,null,0,0,0,0,0,0,0,0]
["DEPENDENCIA MODERADA",null,0,0,0,null,null,null,null,null,null,null,null,null,null,null,null,null,null,null,null,null,null,null,null,null,null,null,null,null,null,null,null,null,null,null,null,null,null,null,null,null,null,null,"",null,null,null,null,null,null,null,null,null,null,null,null,null,null,null,null,null,null,null,null,null,null,null,null,null,null,null,null,null,null,null,null,null,null,"","","","",null,null,null,null,0,0,0,0,0,0,0,0]
["DEPENDENCIA SEVERA","ONCOLÓGICA",0,0,0,null,null,null,null,null,null,null,null,null,null,null,null,null,null,null,null,null,null,null,null,null,null,null,null,null,null,null,null,null,null,null,null,null,null,null,null,null,null,null,"",null,null,null,null,null,null,null,null,null,null,null,null,null,null,null,null,null,null,null,null,null,null,null,null,null,null,null,null,null,null,null,null,null,null,"","","","",null,null,null,null,0,0,0,0,0,0,0,0]
[null,"NO ONCOLÓGICA",0,0,0,null,null,null,null,null,null,null,null,null,null,null,null,null,null,null,null,null,null,null,null,null,null,null,null,null,null,null,null,null,null,null,null,null,null,null,null,null,null,null,"",null,null,null,null,null,null,null,null,null,null,null,null,null,null,null,null,null,null,null,null,null,null,null,null,null,null,null,null,null,null,null,null,null,null,"","","","",null,null,null,null,0,0,0,0,0,0,0,0]
[null,"TOTAL PERSONAS CON LESIÓN POR PRESIÓN*",0,{"$f":"+F34+H34+J34+L34+N34+P34+R34+T34+V34+X34+Z34+AB34+AD34+AF34+AH34+AJ34+AL34","v":0},{"$f":"+G34+I34+K34+M34+O34+Q34+S34+U34+W34+Y34+AA34+AC34+AE34+AG34+AI34+AK34+AM34","v":0},null,null,null,null,null,null,null,null,null,null,null,null,null,null,null,null,null,null,null,null,null,null,null,null,null,null,null,null,null,null,null,null,null,null,null,null,null,null,null,"",null,null,null,null,null,null,null,null,null,null,null,null,null,null,null,null,null,null,null,null,null,null,null,null,null,null,null,null,null,null,null,null,null,null,"","","","",{"$f":"IF($C34<=$C32+$C33,\"\",\"TOTAL PERSONAS CON LESIÓN POR PRESIÓN* no debe ser mayor que los Dependientes oncológicos + no Oncológicos. \")","v":""},null,null,null,0,0,0,0,0,0,0,0]
["ATENCIÓN DOMICILIARIA POR DEPENDENCIA SEVERA","TOTAL PERSONAS",{"$f":"SUM(D35:E35)","v":0},{"$f":"+F35+H35+J35+L35+N35+P35+R35+T35+V35+X35+Z35+AB35+AD35+AF35+AH35+AJ35+AL35","v":0},{"$f":"+G35+I35+K35+M35+O35+Q35+S35+U35+W35+Y35+AA35+AC35+AE35+AG35+AI35+AK35+AM35","v":0},null,null,null,null,null,null,null,null,null,null,null,null,null,null,null,null,null,null,null,null,null,null,null,null,null,null,null,null,null,null,null,null,null,null,null,null,null,null,null,"",null,null,null,null,null,null,null,null,null,null,null,null,null,null,null,null,null,null,null,null,null,null,null,null,null,null,null,null,null,null,null,null,null,null,"","","","",{"$f":"IF($C35<=$C32+$C33,\"\",\"*Atención Domiciliaria por Dependencia Severa / Total Personas no debe ser mayor que los Dependencia Severa / oncológicos + no Oncológicos. \")","v":""},null,null,null,0,0,0,0,0,{"$f":"IF(AND($E35<>0,AP35=\"\"),1,0)","v":0},0,{"$f":"IF(AND($E35<>0,AR35=\"\"),1,0)","v":0},{"$f":"IF($C35<=$C32+C33,0,1)","v":0}]
[null,"ONCOLÓGICA",0,0,0,null,null,null,null,null,null,null,null,null,null,null,null,null,null,null,null,null,null,null,null,null,null,null,null,null,null,null,null,null,null,null,null,null,null,null,null,null,null,null,"",null,null,null,null,null,null,null,null,null,null,null,null,null,null,null,null,null,null,null,null,null,null,null,null,null,null,null,null,null,null,null,null,null,null,"","","","",{"$f":"IF($C36<=$C$35,\"\",\"* Atención Domiciliaria por Dependencia Severa: Total Oncológica no debe ser mayor al Total Personas. \")","v":""},{"$f":"IF($C36<=$C32,\"\",\"* Atención Domiciliaria por Dependencia Severa: Total Oncológica no debe ser mayor a las personas con Dependencia Severa / Oncológica. \")","v":""},null,null,0,0,0,0,0,0,{"$f":"IF(AND($D36<>0,AQ36=\"\"),1,0)","v":0},{"$f":"IF(AND($E36<>0,AR36=\"\"),1,0)","v":0},{"$f":"IF($C36<=$C32,0,1)","v":0}]
[null,"NO ONCOLÓGICA",{"$f":"SUM(D37:E37)","v":0},{"$f":"+F37+H37+J37+L37+N37+P37+R37+T37+V37+X37+Z37+AB37+AD37+AF37+AH37+AJ37+AL37","v":0},{"$f":"+G37+I37+K37+M37+O37+Q37+S37+U37+W37+Y37+AA37+AC37+AE37+AG37+AI37+AK37+AM37","v":0},null,null,null,null,null,null,null,null,null,null,null,null,null,null,null,null,null,null,null,null,null,null,null,null,null,null,null,null,null,null,null,null,null,null,null,null,null,null,null,"",null,null,null,null,null,null,null,null,null,null,null,null,null,null,null,null,null,null,null,null,null,null,null,null,null,null,null,null,null,null,null,null,null,null,"","","","",{"$f":"IF($C37<=$C$35,\"\",\"* Atención Domiciliaria por Dependencia Severa: Total No Oncológica no debe ser mayor al Total Personas. \")","v":""},{"$f":"IF($C37<=$C33,\"\",\"* Atención Domiciliaria por Dependencia Severa: Total No Oncológica no debe ser mayor a las personas con Dependencia Severa / No Oncológica. \")","v":""},null,null,0,0,0,0,0,0,0,0,{"$f":"IF($C37<=$C33,0,1)","v":0}]
[null,"CON DEMENCIA",0,0,0,null,null,null,null,null,null,null,null,null,null,null,null,null,null,null,null,null,null,null,null,null,null,null,null,null,null,null,null,null,null,null,null,null,null,null,null,null,null,null,"",null,null,null,null,null,null,null,null,null,null,null,null,null,null,null,null,null,null,null,null,null,null,null,null,null,null,null,null,null,null,null,null,null,null,"","","","",{"$f":"IF($C38<=$C$35,\"\",\"* Atención Domiciliaria por Dependencia Severa / Con Demencia no debe ser mayor al Total Personas. \")","v":""},null,null,null,0,0,0,0,0,0,0,{"$f":"IF(AND($E38<>0,AR38=\"\"),1,0)","v":0}]
[null,"INSTITUCIONALIZADA",0,0,0,null,null,null,null,null,null,null,null,null,null,null,null,null,null,null,null,null,null,null,null,null,null,null,null,null,null,null,null,null,null,null,null,null,null,null,null,null,null,null,"",null,null,null,null,null,null,null,null,null,null,null,null,null,null,null,null,null,null,null,null,null,null,null,null,null,null,null,null,null,null,null,null,null,null,"","","","",{"$f":"IF($C39<=$C$35,\"\",\"* Atención Domiciliaria por Dependencia Severa / Total Institucionalizada no debe ser mayor al Total Personas. \")","v":""},null,null,null,0,0,0,0,0,0,0,0]
[null,"TOTAL PERSONAS CON LESIÓN POR PRESIÓN*",0,0,0,null,null,null,null,null,null,null,null,null,null,null,null,null,null,null,null,null,null,null,null,null,null,null,null,null,null,null,null,null,null,null,null,null,null,null,null,null,null,null,"",null,null,null,null,null,null,null,null,null,null,null,null,null,null,null,null,null,null,null,null,null,null,null,null,null,null,null,null,null,null,null,null,null,null,"","","","",{"$f":"IF($C40<=$C35,\"\",\"* Atención Domiciliaria por Dependencia Severa / Total Personas con lesión por Presión no debe ser mayor al Total Personas. \")","v":""},{"$f":"IF($C40<=$C34,\"\",\"* Atención Domiciliaria por Dependencia Severa: Total Personas con Lesión por Presión no debe ser mayor a las personas con Dependencia Severa / Total Personas con Lesión por Presión. \")","v":""},null,null,0,0,0,0,0,{"$f":"IF(AND($E40<>0,AP40=\"\"),1,0)","v":0},0,0,{"$f":"IF($C40<=$C34,0,1)","v":0}]
[null,"CON INDICACIÓN DE NUTRICIÓN ENTERAL DOMICILIARIA (NED) ",{"$f":"SUM(D41:E41)","v":0},{"$f":"+F41+H41+J41+L41+N41+P41+R41+T41+V41+X41+Z41+AB41+AD41+AF41+AH41+AJ41+AL41","v":0},{"$f":"+G41+I41+K41+M41+O41+Q41+S41+U41+W41+Y41+AA41+AC41+AE41+AG41+AI41+AK41+AM41","v":0},null,null,null,null,null,null,null,null,null,null,null,null,null,null,null,null,null,null,null,null,null,null,null,null,null,null,null,null,null,null,null,null,null,null,null,null,null,null,null,"",null,null,null,null,null,null,null,null,null,null,null,null,null,null,null,null,null,null,null,null,null,null,null,null,null,null,null,null,null,null,null,null,null,null,"","","","",{"$f":"IF($C41<=$C$35,\"\",\"Atención Domiciliaria por Dependencia Severa/ Con indicación de Nutrición Enteral Domiciliaria no debe ser mayor al Total Personas. \")","v":""},null,null,null,0,0,0,0,0,0,0,0]
["(*) Incluidos en Dependencia Severa Oncológica y NO Oncológica"]
["SECCION B: CUIDADORES DE PACIENTES CON DEPENDENCIA SEVERA"]
["CONCEPTO","Total","Hombres","Mujeres","ATENCIÓN DOMICILIARIA POR DEPENDENCIA SEVERA"]
[null,null,null,null,"Total Cuidadoras/es capacitadas/os","Total cuidadoras/es con examen preventivo vigente","Cuidadoras/es sin examen preventivo, ingresado a programa de salud","Cuidadoras/es con apoyo monetario","Cuidadoras/es en espera de apoyo monetario","Total Cuidadoras/es con evaluacion anual de nivel de sobrecarga","Total Cuidadoras/es mayores de 65 años"]
["NÚMERO DE CUIDADORES",{"$f":"SUM(C46:D46)","v":0},null,null,null,null,null,null,null,null,null,{"$f":"CA46&CB46&CC46&CD46&CE46&CF46&CG46&CH46","v":""},null,null,null,null,null,null,null,null,null,null,null,null,null,null,null,null,null,null,null,null,null,null,null,null,null,null,null,null,null,null,null,null,null,null,null,null,null,null,null,null,null,null,null,null,null,null,null,null,null,null,null,null,null,null,null,null,null,null,null,null,null,null,null,null,null,null,{"$f":"IF(E46>B46,\" * El Total de Cuidadoras/es capacitadas/os No debe ser mayor que el Total Número de cuidadores.\",\"\")","v":""},{"$f":"IF(F46>B46,\" * El Total de Cuidadoras/es con examen preventivo vigente No debe ser mayor que el Total Número de cuidadores.\",\"\")","v":""},{"$f":"IF(G46>B46,\" * El Total de Cuidadoras/es sin examen preventivo ingresado a programa de salud No debe ser mayor que el Total Número de cuidadores.\",\"\")","v":""},{"$f":"IF(H46>B46,\" * El Total de Cuidadoras/es con apoyo monetario No debe ser mayor que el Total Número de cuidadores.\",\"\")","v":""},{"$f":"IF(I46>B46,\" * El Total de Cuidadoras/es en espera de apoyo monetario No debe ser mayor que el Total Número de cuidadores.\",\"\")","v":""},{"$f":"IF(J46>B46,\" * El Total de Cuidadoras/es con evaluación anual de nivel de sobrecarga No debe ser mayor que el Total Número de cuidadores.\",\"\")","v":""},{"$f":"IF(K46>B46,\" * El Total de Cuidadoras/es mayores de 65 años No debe ser mayor que el Total Número de cuidadores.\",\"\")","v":""},null,{"$f":"IF(E46>B46,1,0)","v":0},{"$f":"IF(F46>B46,1,0)","v":0},{"$f":"IF(G46>B46,1,0)","v":0},{"$f":"IF(H46>B46,1,0)","v":0},{"$f":"IF(I46>B46,1,0)","v":0},{"$f":"IF(J46>B46,1,0)","v":0},{"$f":"IF(K46>B46,1,0)","v":0}]
["SECCION C: POBLACIÓN EN CONTROL EN PROGRAMA DE REHABILITACIÓN PULMONAR EN SALA IRA-ERA"]
["PROGRAMA",null,"TOTAL",null,null,"GRUPOS DE EDAD (en años) Y SEXO"]
[null,null,null,null,null,"0 a 4 años",null,"5 a 9 años",null,"10 a 14 años",null,"15 a 19 años",null,"20 a 24 años",null,"25 a 29 años",null,"30 a 34 años",null,"35 a 39 años",null,"40 a 44 años",null,"45 a 49 años",null,"50 a 54 años",null,"55 a 59 años",null,"60 a 64 años",null,"65 a 69 años",null,"70 a 74 años",null,"75 a 79 años",null,"80 y más años"]
[null,null,"Ambos\nsexos","Hombres","Mujeres","Hombres","Mujeres","Hombres","Mujeres","Hombres","Mujeres","Hombres","Mujeres","Hombres","Mujeres","Hombres","Mujeres","Hombres","Mujeres","Hombres","Mujeres","Hombres","Mujeres","Hombres","Mujeres","Hombres","Mujeres","Hombres","Mujeres","Hombres","Mujeres","Hombres ","Mujeres","Hombres ","Mujeres","Hombres ","Mujeres","Hombres ","Mujeres"]
["REHABILITACIÓN PULMONAR","Ingresos",{"$f":"SUM(D51:E51)","v":0},{"$f":"+F51+H51+J51+L51+N51+P51+R51+T51+V51+X51+Z51+AB51+AD51+AF51+AH51+AJ51+AL51","v":0},{"$f":"+G51+I51+K51+M51+O51+Q51+S51+U51+W51+Y51+AA51+AC51+AE51+AG51+AI51+AK51+AM51","v":0}]
[null,"Abandonos",{"$f":"SUM(D52:E52)","v":0},{"$f":"+F52+H52+J52+L52+N52+P52+R52+T52+V52+X52+Z52+AB52+AD52+AF52+AH52+AJ52+AL52","v":0},{"$f":"+G52+I52+K52+M52+O52+Q52+S52+U52+W52+Y52+AA52+AC52+AE52+AG52+AI52+AK52+AM52","v":0}]
[null,"Egresos por termino de ciclo",0,0,{"$f":"+G53+I53+K53+M53+O53+Q53+S53+U53+W53+Y53+AA53+AC53+AE53+AG53+AI53+AK53+AM53","v":0}]
[null,"Articulacion continuidad en intersector",0,0,{"$f":"+G54+I54+K54+M54+O54+Q54+S54+U54+W54+Y54+AA54+AC54+AE54+AG54+AI54+AK54+AM54","v":0}]
["SECCION D: NIVEL DE CONTROL DE POBLACION RESPIRATORIA CRONICA"]
["PROGRAMAS",null,"TOTAL",null,null,"GRUPOS DE EDAD (en años) Y SEXO"]
[null,null,null,null,null,"0 a 4 años",null,"5 a 9 años",null,"10 a 14 años",null,"15 a 19 años",null,"20 a 24 años",null,"25 a 29 años",null,"30 a 34 años",null,"35 a 39 años",null,"40 a 44 años",null,"45 a 49 años",null,"50 a 54 años",null,"55 a 59 años",null,"60 a 64 años",null,"65 a 69 años",null,"70 a 74 años",null,"75 a 79 años",null,"80 y más años"]
[null,null,"Ambos\nsexos","Hombres","Mujeres","Hombres","Mujeres","Hombres","Mujeres","Hombres","Mujeres","Hombres","Mujeres","Hombres","Mujeres","Hombres","Mujeres","Hombres","Mujeres","Hombres","Mujeres","Hombres","Mujeres","Hombres","Mujeres","Hombres","Mujeres","Hombres","Mujeres","Hombres","Mujeres","Hombres ","Mujeres","Hombres ","Mujeres","Hombres ","Mujeres","Hombres ","Mujeres"]
["ASMA BRONQUIAL","Controlado",{"$f":"+D59+E59","v":0},{"$f":"+F59+H59+J59+L59+N59+P59+R59++T59+V59+X59+Z59+AB59+AD59++AF59+AH59+AJ59+AL59","v":0},{"$f":"+G59+I59+K59+M59+O59+Q59+S59++U59+W59+Y59+AA59+AC59+AE59++AG59+AI59+AK59+AM59","v":0},null,null,null,null,null,null,null,null,null,null,null,null,null,null,null,null,null,null,null,null,null,null,null,null,null,null,null,null,null,null,null,null,null,null,{"$f":"CA59&CB59&CC59&CD59&CE59&CF59&CG59&CH59","v":""}]
[null,"Parcialmente Controlado",{"$f":"+D60+E60","v":0},{"$f":"+F60+H60+J60+L60+N60+P60+R60++T60+V60+X60+Z60+AB60+AD60++AF60+AH60+AJ60+AL60","v":0},{"$f":"+G60+I60+K60+M60+O60+Q60+S60++U60+W60+Y60+AA60+AC60+AE60++AG60+AI60+AK60+AM60","v":0},null,null,null,null,null,null,null,null,null,null,null,null,null,null,null,null,null,null,null,null,null,null,null,null,null,null,null,null,null,null,null,null,null,null,{"$f":"CA60&CB60&CC60&CD60&CE60&CF60&CG60&CH60","v":""}]
[null,"No Controlado",0,0,0,null,null,null,null,null,null,null,null,null,null,null,null,null,null,null,null,null,null,null,null,null,null,null,null,null,null,null,null,null,null,null,null,null,null,""]
[null,"No evaluada",0,0,0,null,null,null,null,null,null,null,null,null,null,null,null,null,null,null,null,null,null,null,null,null,null,null,null,null,null,null,null,null,null,null,null,null,null,"",null,null,null,null,null,null,null,null,null,null,null,null,null,null,null,null,null,null,null,null,null,null,null,null,null,null,null,null,null,null,null,null,null,null,null,null,null,null,null,{"$f":"IF(SUM(C15:C17)>=SUM(C59:C62),\"\",\"* El total de Asma Bronquial en ambos sexo no puede ser mayor al total de Asma Bronquial de ambos sexo de la Sección A. \")","v":""},null,null,null,null,null,null,{"$f":"IF(SUM(C15:C17)>=SUM(C59:C62),0,1)","v":0}]
["ENFERMEDAD PULMONAR OBSTRUCTIVA CRÓNICA (EPOC)","Logra Control Adecuado",0,{"$f":"+V63+X63+Z63+AB63+AD63+AF63+AH63+AJ63+AL63","v":0},{"$f":"+W63+Y63+AA63+AC63+AE63+AG63+AI63+AK63+AM63","v":0},null,null,null,null,null,null,null,null,null,null,null,null,null,null,null,null,null,null,null,null,null,null,null,null,null,null,null,null,null,null,null,null,null,null,""]
[null,"No Logra Control Adecuado",0,{"$f":"+V64+X64+Z64+AB64+AD64+AF64+AH64+AJ64+AL64","v":0},{"$f":"+W64+Y64+AA64+AC64+AE64+AG64+AI64+AK64+AM64","v":0},null,null,null,null,null,null,null,null,null,null,null,null,null,null,null,null,null,null,null,null,null,null,null,null,null,null,null,null,null,null,null,null,null,null,""]
[null,"No evaluada",0,0,0,null,null,null,null,null,null,null,null,null,null,null,null,null,null,null,null,null,null,null,null,null,null,null,null,null,null,null,null,null,null,null,null,null,null,"",null,null,null,null,null,null,null,null,null,null,null,null,null,null,null,null,null,null,null,null,null,null,null,null,null,null,null,null,null,null,null,null,null,null,null,null,null,null,null,{"$f":"IF(SUM(C63:C65)>SUM(C18:C19),\"* El total de EPOC en ambos sexos no puede ser superior al total de EPOC en ambos sexos de la sección A. \",\"\")","v":""},null,null,null,null,null,null,{"$f":"IF(SUM(C63:C65)>SUM(C18:C19),1,0)","v":0}]
["SECCIÓN E:  RESULTADO DE ENCUESTA CALIDAD DE VIDA"]
["DIAGNÓSTICO","ACTIVIDAD","TOTAL",null,null,"GRUPOS DE EDAD (en años) Y SEXO"]
[null,null,null,null,null,"0 a 4 años",null,"5 - 9 \naños",null,"10 - 14\naños",null,"15 - 19\naños",null,"20 a 24 años\n",null,"25 a 29 años",null,"30 a 34 años",null,"35 a 39 años",null,"40 - 44 años",null,"45 - 49 años",null,"50 - 54 años",null,"55 - 59 años",null,"60 - 64 años",null,"65 - 69 años",null,"70 - 74 años",null,"75 - 79 años",null,"80 y mas años"]
[null,null,"Ambos Sexos","Hombres","Mujeres","Hombres","Mujeres","Hombres","Mujeres","Hombres","Mujeres","Hombres","Mujeres","Hombres","Mujeres","Hombres","Mujeres","Hombres","Mujeres","Hombres","Mujeres","Hombres","Mujeres","Hombres","Mujeres","Hombres","Mujeres","Hombres","Mujeres","Hombres","Mujeres","Hombres","Mujeres","Hombres","Mujeres","Hombres","Mujeres","Hombres","Mujeres"]
["ENFERMEDAD PULMONAR OBSTRUCTIVA CRÓNICA (EPOC)","Evaluados",{"$f":"SUM(D70:E70)","v":0},{"$f":"+V70+X70+Z70+AB70+AD70+AF70+AH70+AJ70+AL70","v":0},{"$f":"+W70+Y70+AA70+AC70+AE70+AG70+AI70+AK70+AM70","v":0}]
[null,"Mejora en relación a  año anterior",{"$f":"SUM(D71:E71)","v":0},{"$f":"+V71+X71+Z71+AB71+AD71+AF71+AH71+AJ71+AL71","v":0},{"$f":"+W71+Y71+AA71+AC71+AE71+AG71+AI71+AK71+AM71","v":0}]
[null,"No mejora en relación a año anterior",{"$f":"SUM(D72:E72)","v":0},{"$f":"+V72+X72+Z72+AB72+AD72+AF72+AH72+AJ72+AL72","v":0},{"$f":"+W72+Y72+AA72+AC72+AE72+AG72+AI72+AK72+AM72","v":0}]
["ASMA BRONQUIAL","Evaluados",0,{"$f":"+F73+H73+J73+L73+N73+P73+R73+T73+V73+X73+Z73+AB73+AD73+AF73+AH73+AJ73+AL73","v":0},{"$f":"+G73+I73+K73+M73+O73+Q73+S73+U73+W73+Y73+AA73+AC73+AE73+AG73+AI73+AK73+AM73","v":0}]
[null,"Mejora en relación a  año anterior",0,{"$f":"+F74+H74+J74+L74+N74+P74+R74+T74+V74+X74+Z74+AB74+AD74+AF74+AH74+AJ74+AL74","v":0},{"$f":"+G74+I74+K74+M74+O74+Q74+S74+U74+W74+Y74+AA74+AC74+AE74+AG74+AI74+AK74+AM74","v":0}]
[null,"No mejora en relación a año anterior",0,0,0]
["OTRAS CRÓNICAS RESPIRATORIAS","Evaluados",0,{"$f":"+F76+H76+J76+L76+N76+P76+R76+T76+V76+X76+Z76+AB76+AD76+AF76+AH76+AJ76+AL76","v":0},{"$f":"+G76+I76+K76+M76+O76+Q76+S76+U76+W76+Y76+AA76+AC76+AE76+AG76+AI76+AK76+AM76","v":0}]
[null,"Mejora en relación a año anterior",0,0,{"$f":"+G77+I77+K77+M77+O77+Q77+S77+U77+W77+Y77+AA77+AC77+AE77+AG77+AI77+AK77+AM77","v":0}]
[null,"No mejora en relación a año anterior",0,0,0]
[]
[]
[]
[]
[]
[]
[]
[]
[{"$f":"SUM(C12:C41,B46,C51:C54,C59:C65,C70:C78)","v":0},"datos"]
[{"$f":"SUM(CI12:CR66)","v":0},"errores"]

{"sheet":"P4","index":4,"n_rows":101,"n_cols":123,"rows_kept":101,"cut":false,"hidden":false,"merged":[[12,0,14,0],[44,27,44,28],[8,35,9,36],[84,0,84,1],[68,0,68,1],[69,0,69,1],[51,0,51,1],[81,0,81,1],[54,0,54,1],[43,0,45,1],[78,0,78,1],[43,33,44,34],[53,0,53,1],[11,0,11,1],[9,25,9,26],[8,33,9,34],[47,0,47,1],[31,31,31,32],[31,25,31,26],[31,29,31,30],[31,11,31,12],[31,7,31,8],[43,2,44,4],[43,5,43,32],[77,0,77,1],[64,0,66,0],[57,0,57,1],[75,0,75,1],[31,9,31,10],[76,0,76,1],[82,0,82,1],[44,5,44,6],[44,7,44,8],[44,9,44,10],[79,0,79,1],[67,0,67,1],[46,2,46,36],[74,2,74,36],[80,2,80,36],[60,0,63,0],[59,0,59,1],[15,0,20,0],[50,0,50,1],[30,2,31,4],[31,5,31,6],[52,0,52,1],[39,0,41,0],[48,0,48,1],[33,0,34,0],[49,0,49,1],[21,0,28,0],[29,0,29,1],[30,0,32,1],[35,0,37,0],[30,5,30,32],[31,27,31,28],[31,17,31,18],[31,19,31,20],[44,11,44,12],[44,13,44,14],[44,15,44,16],[44,17,44,18],[44,29,44,30],[8,62,9,62],[8,57,9,58],[8,59,10,59],[8,61,9,61],[8,55,9,56],[8,37,10,37],[43,35,44,36],[6,0,6,20],[8,0,10,1],[8,2,9,4],[9,15,9,16],[9,17,9,18],[9,19,9,20],[9,9,9,10],[9,11,9,12],[9,13,9,14],[8,5,8,32],[9,5,9,6],[9,7,9,8],[9,27,9,28],[9,21,9,22],[9,29,9,30],[9,31,9,32],[9,23,9,24],[85,0,85,1],[43,99,44,99],[43,100,44,100],[43,55,44,56],[43,57,44,58],[43,91,44,92],[44,31,44,32],[70,0,70,1],[30,33,31,34],[30,35,31,36],[31,13,31,14],[31,15,31,16],[43,93,44,94],[43,61,44,61],[43,62,44,62],[31,21,31,22],[31,23,31,24],[44,23,44,24],[44,25,44,26],[44,19,44,20],[44,21,44,22],[55,0,55,1],[80,0,80,1],[83,0,83,1]]}
["DATOS DEL ESTABLECIMIENTO"]
[{"$f":"CONCATENATE(\"COMUNA: \",NOMBRE!$B$2,\" - \",\"( \",NOMBRE!$C$2,NOMBRE!$D$2,NOMBRE!$E$2,NOMBRE!$F$2,NOMBRE!$G$2,\" )\")","v":"COMUNA:  - (  )"}]
[{"$f":"CONCATENATE(\"ESTABLECIMIENTO/ESTRATEGIA: \",NOMBRE!$B$3,\" - \",\"( \",NOMBRE!$C$3,NOMBRE!$D$3,NOMBRE!$E$3,NOMBRE!$F$3,NOMBRE!$G$3,NOMBRE!$H$3,\" )\")","v":"ESTABLECIMIENTO/ESTRATEGIA:  - (  )"}]
[{"$f":"CONCATENATE(\"MES: \",NOMBRE!$B$6,\" - \",\"( \",NOMBRE!$C$6,NOMBRE!$D$6,\" )\")","v":"MES:  - (  )"}]
[{"$f":"CONCATENATE(\"AÑO: \",NOMBRE!$B$7)","v":"AÑO: 2024"}]
[]
["REM-P4. POBLACIÓN EN CONTROL PROGRAMA DE SALUD CARDIOVASCULAR (PSCV)"]
["SECCIÓN A: PROGRAMA SALUD CARDIOVASCULAR (PSCV)"]
["CONCEPTO",null,"TOTAL ",null,null,"GRUPOS DE EDAD (en años) Y SEXO",null,null,null,null,null,null,null,null,null,null,null,null,null,null,null,null,null,null,null,null,null,null,null,null,null,null,null,"Pueblos Originarios",null," Migrantes",null,"Pacientes Diabéticos",null,null,null,null,null,null,null,null,null,null,null,null,null,null,null,null,null,"Pueblos Originarios",null,"Población Migrantes",null,"Pacientes Diabéticos",null,"Pueblos Originarios","Población Migrantes"]
[null,null,null,null,null,"15 a 19 años",null,"20 a 24 años",null,"25 a 29 años",null,"30 a 34 años",null,"35 a 39 años",null,"40 a 44 años",null,"45 a 49 años",null,"50 a 54 años",null,"55 a 59 años",null,"60 a 64 años",null,"65 a 69 años",null,"70 a 74 años",null,"75 a 79 años",null,"80 y más años"]
[null,null,"Ambos sexos","Hombres","Mujeres","Hombres","Mujeres","Hombres","Mujeres","Hombres","Mujeres","Hombres","Mujeres","Hombres","Mujeres","Hombres","Mujeres","Hombres","Mujeres","Hombres","Mujeres","Hombres","Mujeres","Hombres","Mujeres","Hombres ","Mujeres","Hombres ","Mujeres","Hombres ","Mujeres","Hombres ","Mujeres","Hombres","Mujeres","Hombres","Mujeres",null,null,null,null,null,null,null,null,null,null,null,null,null,null,null,null,null,null,"Hombres","Mujeres","Hombres","Mujeres",null,null,"No Olvide","No Olvide"]
["NUMERO DE PERSONAS EN PSCV",null,{"$f":"SUM(D12:E12)","v":0},{"$f":"+F12+H12+J12+L12+N12+P12+R12+T12+V12+X12+Z12+AB12+AD12+AF12","v":0},{"$f":"+G12+I12+K12+M12+O12+Q12+S12+U12+W12+Y12+AA12+AC12+AE12+AG12","v":0},{"$f":"SUM(F13:F15)","v":0},{"$f":"SUM(G13:G15)","v":0},0,0,0,0,0,0,0,0,0,0,0,0,0,0,0,0,0,0,0,0,0,0,0,0,0,0,{"$f":"SUM(AH13:AH15)","v":0},{"$f":"SUM(AI13:AI15)","v":0},0,{"$f":"SUM(AK13:AK15)","v":0}]
["CLASIFICACIÓN DEL\nRIESGO\nCARDIOVASCULAR","BAJO",{"$f":"SUM(D13:E13)","v":0},{"$f":"+F13+H13+J13+L13+N13+P13+R13+T13+V13+X13+Z13+AB13+AD13+AF13","v":0},{"$f":"+G13+I13+K13+M13+O13+Q13+S13+U13+W13+Y13+AA13+AC13+AE13+AG13","v":0},null,null,null,null,null,null,null,null,null,null,null,null,null,null,null,null,null,null,null,null,null,null,null,null,null,null,null,null,null,null,null,null,null,{"$f":" BD13 & BE13 & BF13 & BG13 & BH13 & BJ13 & BK13","v":""},null,null,null,null,null,null,null,null,null,null,null,null,null,null,null,null,{"$f":"IF(AH13>D13,\"* Pueblos Originarios Hombres no debe ser mayor al Total Hombres. \",\"\")","v":""},{"$f":"IF(AI13>E13,\"* Pueblos Originarios Mujeres no debe ser mayor al Total Mujeres. \",\"\")","v":""},{"$f":"IF(AJ13>D13,\"* Población Migrantes Hombres no debe ser mayor al Total Hombres. \",\"\")","v":""},{"$f":"IF(AK13>E13,\"* Población Migrantes Mujeres no debe ser mayor al Total Mujeres. \",\"\")","v":""},{"$f":"IF(C12<>C29, \"* El numero de Personas en PSCV de ambos sexos debe ser igual al total de detección y prevención de la progresión de la enfermedad renal crónica de ambos sexos. \",\"\")","v":""},null,{"$f":"IF(AND(D13<>0,AH13=\"\"),\"* No olvide escribir en la celda de 'Pueblos Originarios Hombres' (Digite CERO si no tiene). \",IF(AND(E13<>0,AI13=\"\"),\"* No olvide escribir en la celda de 'Pueblos Originarios Mujeres' (Digite CERO si no tiene). \",\"\"))","v":""},{"$f":"IF(AND(D13<>0,AJ13=\"\"),\"* No olvide escribir en la celda de Población Migrantes Hombres (Digite CERO si no tiene). \",IF(AND(E13<>0,AK13=\"\"),\"* No olvide escribir en la celda de Población Migrantes Mujeres (Digite CERO si no tiene). \",\"\"))","v":""},null,null,null,null,null,null,null,null,null,null,null,null,null,null,null,null,null,null,null,null,null,null,null,null,null,null,null,null,{"$f":"IF(AH13>D13,1,0)","v":0},{"$f":"IF(AI13>E13,1,0)","v":0},{"$f":"IF(AJ13>D13,1,0)","v":0},{"$f":"IF(AK13>E13,1,0)","v":0},{"$f":"IF(C12<>C29, 1,0)","v":0},null,null,null,{"$f":"IF(AND(D13<>0,AH13=\"\"),1,IF(AND(E13<>0,AI13=\"\"),1,0))","v":0},{"$f":"IF(AND(D13<>0,AJ13=\"\"),1,IF(AND(E13<>0,AK13=\"\"),1,0))","v":0}]
[null,"MODERADO",0,{"$f":"+F14+H14+J14+L14+N14+P14+R14+T14+V14+X14+Z14+AB14+AD14+AF14","v":0},0,null,null,null,null,null,null,null,null,null,null,null,null,null,null,null,null,null,null,null,null,null,null,null,null,null,null,null,null,null,null,null,null,null,{"$f":" BD14 & BE14 & BF14 & BG14 & BJ14 & BK14","v":""},null,null,null,null,null,null,null,null,null,null,null,null,null,null,null,null,{"$f":"IF(AH14>D14,\"* Pueblos Originarios Hombres no debe ser mayor al Total Hombres. \",\"\")","v":""},{"$f":"IF(AI14>E14,\"* Pueblos Originarios Mujeres no debe ser mayor al Total Mujeres. \",\"\")","v":""},{"$f":"IF(AJ14>D14,\"* Población Migrantes Hombres no debe ser mayor al Total Hombres. \",\"\")","v":""},{"$f":"IF(AK14>E14,\"* Población Migrantes Mujeres no debe ser mayor al Total Mujeres. \",\"\")","v":""},null,null,{"$f":"IF(AND(D14<>0,AH14=\"\"),\"* No olvide escribir en la celda de 'Pueblos Originarios Hombres' (Digite CERO si no tiene). \",IF(AND(E14<>0,AI14=\"\"),\"* No olvide escribir en la celda de 'Pueblos Originarios Mujeres' (Digite CERO si no tiene). \",\"\"))","v":""},{"$f":"IF(AND(D14<>0,AJ14=\"\"),\"* No olvide escribir en la celda de Población Migrantes Hombres (Digite CERO si no tiene). \",IF(AND(E14<>0,AK14=\"\"),\"* No olvide escribir en la celda de Población Migrantes Mujeres (Digite CERO si no tiene). \",\"\"))","v":""},null,null,null,null,null,null,null,null,null,null,null,null,null,null,null,null,null,null,null,null,null,null,null,null,null,null,null,null,{"$f":"IF(AH14>D14,1,0)","v":0},{"$f":"IF(AI14>E14,1,0)","v":0},{"$f":"IF(AJ14>D14,1,0)","v":0},{"$f":"IF(AK14>E14,1,0)","v":0},null,null,null,null,{"$f":"IF(AND(D14<>0,AH14=\"\"),1,IF(AND(E14<>0,AI14=\"\"),1,0))","v":0},{"$f":"IF(AND(D14<>0,AJ14=\"\"),1,IF(AND(E14<>0,AK14=\"\"),1,0))","v":0}]
[null,"ALTO",0,0,0,null,null,null,null,null,null,null,null,null,null,null,null,null,null,null,null,null,null,null,null,null,null,null,null,null,null,null,null,null,null,null,null,null,"",null,null,null,null,null,null,null,null,null,null,null,null,null,null,null,null,"","","","",null,null,"","",null,null,null,null,null,null,null,null,null,null,null,null,null,null,null,null,null,null,null,null,null,null,null,null,null,null,null,null,0,0,0,0,null,null,null,null,0,0]
["PERSONAS BAJO CONTROL SEGÚN PATOLOGÍA Y FACTORES DE RIESGO (EXISTENCIA)","HIPERTENSIÓN ARTERIAL",0,0,0,null,null,null,null,null,null,null,null,null,null,null,null,null,null,null,null,null,null,null,null,null,null,null,null,null,null,null,null,null,null,null,null,null,"",null,null,null,null,null,null,null,null,null,null,null,null,null,null,null,null,"","","","",null,null,"","",null,null,null,null,null,null,null,null,null,null,null,null,null,null,null,null,null,null,null,null,null,null,null,null,null,null,null,null,0,0,0,0,null,null,null,null,0,0]
[null,"DIABETES MELLITUS TIPO 2",0,{"$f":"+F17+H17+J17+L17+N17+P17+R17+T17+V17+X17+Z17+AB17+AD17+AF17","v":0},0,null,null,null,null,null,null,null,null,null,null,null,null,null,null,null,null,null,null,null,null,null,null,null,null,null,null,null,null,null,null,null,null,null,"",null,null,null,null,null,null,null,null,null,null,null,null,null,null,null,null,"","","","",null,null,"","",null,null,null,null,null,null,null,null,null,null,null,null,null,null,null,null,null,null,null,null,null,null,null,null,null,null,null,null,0,0,0,0,null,null,null,null,0,0]
[null,"DISLIPIDEMIA",0,0,0,null,null,null,null,null,null,null,null,null,null,null,null,null,null,null,null,null,null,null,null,null,null,null,null,null,null,null,null,null,null,null,null,null,"",null,null,null,null,null,null,null,null,null,null,null,null,null,null,null,null,"","","","",null,null,"","",null,null,null,null,null,null,null,null,null,null,null,null,null,null,null,null,null,null,null,null,null,null,null,null,null,null,null,null,0,0,0,0,null,null,null,null,0,0]
[null,"TABAQUISMO ≥ 55 AÑOS",0,{"$f":"+V19+X19+Z19+AB19+AD19+AF19","v":0},{"$f":"+W19+Y19+AA19+AC19+AE19+AG19","v":0},null,null,null,null,null,null,null,null,null,null,null,null,null,null,null,null,null,null,null,null,null,null,null,null,null,null,null,null,null,null,null,null,null,"",null,null,null,null,null,null,null,null,null,null,null,null,null,null,null,null,"","","","",null,null,"","",null,null,null,null,null,null,null,null,null,null,null,null,null,null,null,null,null,null,null,null,null,null,null,null,null,null,null,null,0,0,0,0,null,null,null,null,0,0]
[null,"ANTECEDENTES DE INFARTO AGUDO AL MIOCARDIO (IAM)",0,{"$f":"+F20+H20+J20+L20+N20+P20+R20+T20+V20+X20+Z20+AB20+AD20+AF20","v":0},0,null,null,null,null,null,null,null,null,null,null,null,null,null,null,null,null,null,null,null,null,null,null,null,null,null,null,null,null,null,null,null,null,null,"",null,null,null,null,null,null,null,null,null,null,null,null,null,null,null,null,"","","","",null,null,"","",null,null,null,null,null,null,null,null,null,null,null,null,null,null,null,null,null,null,null,null,null,null,null,null,null,null,null,null,0,0,0,0,null,null,null,null,0,0]
[null,"ANTECEDENTES DE ENFERMEDAD CEREBRO VASCULAR ",0,{"$f":"+F21+H21+J21+L21+N21+P21+R21+T21+V21+X21+Z21+AB21+AD21+AF21","v":0},0,null,null,null,null,null,null,null,null,null,null,null,null,null,null,null,null,null,null,null,null,null,null,null,null,null,null,null,null,null,null,null,null,null,"",null,null,null,null,null,null,null,null,null,null,null,null,null,null,null,null,"","","","",null,null,"","",null,null,null,null,null,null,null,null,null,null,null,null,null,null,null,null,null,null,null,null,null,null,null,null,null,null,null,null,0,0,0,0,null,null,null,null,0,0]
["DETECCIÓN Y PREVENCION DE LA PROGRESION DE LA ENFERMEDAD RENAL CRÓNICA (ERC)","SIN ENFERMEDAD RENAL (S/ERC)",{"$f":"SUM(D22:E22)","v":0},{"$f":"+F22+H22+J22+L22+N22+P22+R22+T22+V22+X22+Z22+AB22+AD22+AF22","v":0},0,null,null,null,null,null,null,null,null,null,null,null,null,null,null,null,null,null,null,null,null,null,null,null,null,null,null,null,null,null,null,null,null,null,{"$f":" BD22 & BE22 & BH22 & BF22 & BG22 & BJ22 & BK22","v":""},null,null,null,null,null,null,null,null,null,null,null,null,null,null,null,null,"","","","",{"$f":"IF($AL22<=$C22,\"\",\"* Personas diabéticas 'Sin enfermedad renal' no debe ser mayor que el Total pacientes evaluados. \")","v":""},null,"","",null,null,null,null,null,null,null,null,null,null,null,null,null,null,null,null,null,null,null,null,null,null,null,null,null,null,null,null,0,0,0,0,{"$f":"IF($AL22<=$C22,0,1)","v":0},null,null,null,0,0]
[null,"ETAPA G1 ",{"$f":"SUM(D23:E23)","v":0},0,0,null,null,null,null,null,null,null,null,null,null,null,null,null,null,null,null,null,null,null,null,null,null,null,null,null,null,null,null,null,null,null,null,null,"",null,null,null,null,null,null,null,null,null,null,null,null,null,null,null,null,"","","","",{"$f":"IF($AL23<=$C23,\"\",\"* Personas diabéticas 'Etapa G1 no debe ser mayor que el Total pacientes evaluados. \")","v":""},null,"","",null,null,null,null,null,null,null,null,null,null,null,null,null,null,null,null,null,null,null,null,null,null,null,null,null,null,null,null,0,0,0,0,{"$f":"IF($AL23<=$C23,0,1)","v":0},null,null,null,0,0]
[null,"ETAPA G2 ",{"$f":"SUM(D24:E24)","v":0},0,0,null,null,null,null,null,null,null,null,null,null,null,null,null,null,null,null,null,null,null,null,null,null,null,null,null,null,null,null,null,null,null,null,null,{"$f":" BD24 & BE24 & BH24 & BF24 & BG24 & BJ24 & BK24","v":""},null,null,null,null,null,null,null,null,null,null,null,null,null,null,null,null,"","","","",{"$f":"IF($AL24<=$C24,\"\",\"* Personas diabéticas 'Etapa G2' no debe ser mayor que el Total pacientes evaluados. \")","v":""},null,"","",null,null,null,null,null,null,null,null,null,null,null,null,null,null,null,null,null,null,null,null,null,null,null,null,null,null,null,null,0,0,0,0,0,null,null,null,0,0]
[null,"ETAPA G3a",0,0,0,null,null,null,null,null,null,null,null,null,null,null,null,null,null,null,null,null,null,null,null,null,null,null,null,null,null,null,null,null,null,null,null,null,"",null,null,null,null,null,null,null,null,null,null,null,null,null,null,null,null,"","","","",{"$f":"IF($AL25<=$C25,\"\",\"* Personas diabéticas 'Etapa G3a' no debe ser mayor que el Total pacientes evaluados. \")","v":""},null,"","",null,null,null,null,null,null,null,null,null,null,null,null,null,null,null,null,null,null,null,null,null,null,null,null,null,null,null,null,0,0,0,0,0,null,null,null,0,0]
[null,"ETAPA G3b ",0,0,0,null,null,null,null,null,null,null,null,null,null,null,null,null,null,null,null,null,null,null,null,null,null,null,null,null,null,null,null,null,null,null,null,null,"",null,null,null,null,null,null,null,null,null,null,null,null,null,null,null,null,"","","","",{"$f":"IF($AL26<=$C26,\"\",\"* Personas diabéticas 'Etapa G3b' no debe ser mayor que el Total pacientes evaluados. \")","v":""},null,"","",null,null,null,null,null,null,null,null,null,null,null,null,null,null,null,null,null,null,null,null,null,null,null,null,null,null,null,null,0,0,0,0,0,null,null,null,0,0]
[null,"ETAPA G4  ",0,0,0,null,null,null,null,null,null,null,null,null,null,null,null,null,null,null,null,null,null,null,null,null,null,null,null,null,null,null,null,null,null,null,null,null,"",null,null,null,null,null,null,null,null,null,null,null,null,null,null,null,null,"","","","",{"$f":"IF($AL27<=$C27,\"\",\"* Personas diabéticas 'Etapa G4' no debe ser mayor que el Total pacientes evaluados. \")","v":""},null,"","",null,null,null,null,null,null,null,null,null,null,null,null,null,null,null,null,null,null,null,null,null,null,null,null,null,null,null,null,0,0,0,0,0,null,null,null,0,0]
[null,"ETAPA G5",0,0,0,null,null,null,null,null,null,null,null,null,null,null,null,null,null,null,null,null,null,null,null,null,null,null,null,null,null,null,null,null,null,null,null,null,"",null,null,null,null,null,null,null,null,null,null,null,null,null,null,null,null,"","","","",{"$f":"IF($AL28<=$C28,\"\",\"* Personas diabéticas 'Etapa G5' no debe ser mayor que el Total pacientes evaluados. \")","v":""},null,"","",null,null,null,null,null,null,null,null,null,null,null,null,null,null,null,null,null,null,null,null,null,null,null,null,null,null,null,null,0,0,0,0,0,null,null,null,0,0]
[null,"TOTAL",{"$f":"SUM(D29:E29)","v":0},{"$f":"+F29+H29+J29+L29+N29+P29+R29+T29+V29+X29+Z29+AB29+AD29+AF29","v":0},{"$f":"+G29+I29+K29+M29+O29+Q29+S29+U29+W29+Y29+AA29+AC29+AE29+AG29","v":0},{"$f":"SUM(F22:F28)","v":0},{"$f":"SUM(G22:G28)","v":0},0,0,0,0,0,0,0,0,0,0,0,0,0,0,0,0,0,0,0,0,0,0,0,0,0,0,0,0,0,0,{"$f":"SUM(AL22:AL28)","v":0}]
["SECCIÓN B: METAS DE COMPENSACIÓN"]
["CONCEPTO",null,"TOTAL ",null,null,"GRUPOS DE EDAD (en años) Y SEXO",null,null,null,null,null,null,null,null,null,null,null,null,null,null,null,null,null,null,null,null,null,null,null,null,null,null,null,"Pueblos Originarios",null," Migrantes"]
[null,null,null,null,null,"15 a 19 años",null,"20 a 24 años",null,"25 a 29 años",null,"30 a 34 años",null,"35 a 39 años",null,"40 a 44 años",null,"45 a 49 años",null,"50 a 54 años",null,"55 a 59 años",null,"60 a 64 años",null,"65 a 69 años",null,"70 a 74 años",null,"75 a 79 años",null,"80 y más años"]
[null,null,"Ambos sexos","Hombres","Mujeres","Hombres","Mujeres","Hombres","Mujeres","Hombres","Mujeres","Hombres","Mujeres","Hombres","Mujeres","Hombres","Mujeres","Hombres","Mujeres","Hombres","Mujeres","Hombres","Mujeres","Hombres","Mujeres","Hombres ","Mujeres","Hombres ","Mujeres","Hombres ","Mujeres","Hombres ","Mujeres","Hombres","Mujeres","Hombres","Mujeres"]
["PERSONAS BAJO CONTROL POR HIPERTENSION","PA < 140/90 mmHg ",{"$f":"SUM(D34:E34)","v":0},{"$f":"+F34+H34+J34+L34+N34+P34+R34+T34+V34+X34+Z34+AB34+AD34","v":0},{"$f":"+G34+I34+K34+M34+O34+Q34+S34+U34+W34+Y34+AA34+AC34+AE34","v":0},null,null,null,null,null,null,null,null,null,null,null,null,null,null,null,null,null,null,null,null,null,null,null,null,null,null,null,null,null,null,null,null,{"$f":" BD34 & BE34 & BH34 & BI34 & BJ34 & BK34 & BL34 & BM34 & BN34 & BO34 & BP34 & BQ34 & BR34 & BS34 & BT34 & BU34 & BV34 & BW34 & BX34 & BY34 & BZ34 & CA34 & CB34 & CC34 & CD34 & CE34 & CF34 & CH34 & CI34 & CG34 & BF34 & BG34 & BB34 & BC34","v":""},null,null,null,null,null,null,null,null,null,null,null,null,null,null,null,{"$f":"IF(AND(D34<>0,AH34=\"\"),\"* No olvide escribir en la celda de Pueblos Originarios Hombres (Digite CERO si no tiene). \",IF(AND(E34<>0,AI34=\"\"),\"* No olvide escribir en la celda de Pueblos Originarios Mujeres (Digite CERO si no tiene). \",\"\"))","v":""},{"$f":"IF(AND(D34<>0,AJ34=\"\"),\"* No olvide escribir en la celda de Población Migrantes Hombres (Digite CERO si no tiene). \",IF(AND(E34<>0,AK34=\"\"),\"* No olvide escribir en la celda de Población Migrantes Mujeres (Digite CERO si no tiene). \",\"\"))","v":""},{"$f":"IF(D34>=AH34,\"\",\"* Pueblos Originarios Hombres no debe ser mayor al Total Hombres. \")","v":""},{"$f":"IF(E34>=AI34,\"\",\"* Pueblos Originarios Mujeres no debe ser mayor al Total Mujeres. \")","v":""},{"$f":"IF(D34>=AJ34,\"\",\"* Población Migrantes Hombres no debe ser mayor al Total Hombres. \")","v":""},{"$f":"IF(E34>=AK34,\"\",\"* Pueblos Originarios Mujeres no debe ser mayor al Total Mujeres. \")","v":""},{"$f":"IF($F$34<=$F$16,\"\",\"* Pacientes 15 a 19 años (Hombres) con PA<140/90 mmHg debe ser menor o igual a Hipertensos en Sección A. \")","v":""},{"$f":"IF($G$34<=$G$16,\"\",\"* Pacientes 15 a 19 años (Mujeres) con PA<140/90 mmHg debe ser menor o igual a Hipertensos en Sección A. \")","v":""},{"$f":"IF($H$34<=$H$16,\"\",\"* Pacientes 20 a 24 años (Hombres) con PA<140/90 mmHg debe ser menor o igual a Hipertensos en Sección A. \")","v":""},{"$f":"IF($I$34<=$I$16,\"\",\"* Pacientes 20 a 24 años (Mujeres) con PA<140/90 mmHg debe ser menor o igual a Hipertensos en Sección A. \")","v":""},{"$f":"IF($J$34<=$J$16,\"\",\"* Pacientes 25 a 29 años (Hombres) con PA<140/90 mmHg debe ser menor o igual a Hipertensos en Sección A. \")","v":""},{"$f":"IF($K$34<=$K$16,\"\",\"* Pacientes 25 a 29 años (Mujeres) con PA<140/90 mmHg debe ser menor o igual a Hipertensos en Sección A. \")","v":""},{"$f":"IF($L$34<=$L$16,\"\",\"* Pacientes 30 a 34 años (Hombres) con PA<140/90 mmHg debe ser menor o igual a Hipertensos en Sección A. \")","v":""},{"$f":"IF($M$34<=$M$16,\"\",\"* Pacientes 30 a 34 años (Mujeres) con PA<140/90 mmHg debe ser menor o igual a Hipertensos en Sección A. \")","v":""},{"$f":"IF($N$34<=$N$16,\"\",\"* Pacientes 35 a 39 años (Hombres) con PA<140/90 mmHg debe ser menor o igual a Hipertensos en Sección A. \")","v":""},{"$f":"IF($O$34<=$O$16,\"\",\"* Pacientes 35 a 39 años (Mujeres) con PA<140/90 mmHg debe ser menor o igual a Hipertensos en Sección A. \")","v":""},{"$f":"IF($P$34<=$P$16,\"\",\"* Pacientes 40 a 44 años (Hombres) con PA<140/90 mmHg debe ser menor o igual a Hipertensos en Sección A. \")","v":""},{"$f":"IF($Q$34<=$Q$16,\"\",\"* Pacientes 40 a 44 años (Mujeres) con PA<140/90 mmHg debe ser menor o igual a Hipertensos en Sección A. \")","v":""},{"$f":"IF($R$34<=$R$16,\"\",\"* Pacientes 45 a 49 años (Hombres) con PA<140/90 mmHg debe ser menor o igual a Hipertensos en Sección A. \")","v":""},{"$f":"IF($S$34<=$S$16,\"\",\"* Pacientes 45 a 49 años (Mujeres) con PA<140/90 mmHg debe ser menor o igual a Hipertensos en Sección A. \")","v":""},{"$f":"IF($T$34<=$T$16,\"\",\"* Pacientes 50 a 54 años (Hombres) con PA<140/90 mmHg debe ser menor o igual a Hipertensos en Sección A. \")","v":""},{"$f":"IF($U$34<=$U$16,\"\",\"* Pacientes 50 a 54 años (Mujeres) con PA<140/90 mmHg debe ser menor o igual a Hipertensos en Sección A. \")","v":""},{"$f":"IF($V$34<=$V$16,\"\",\"* Pacientes 55 a 59 años (Hombres) con PA<140/90 mmHg debe ser menor o igual a Hipertensos en Sección A. \")","v":""},{"$f":"IF($W$34<=$W$16,\"\",\"* Pacientes 55 a 59 años (Mujeres) con PA<140/90 mmHg debe ser menor o igual a Hipertensos en Sección A. \")","v":""},{"$f":"IF($X$34<=$X$16,\"\",\"* Pacientes 60 a 64 años (Hombres) con PA<140/90 mmHg debe ser menor o igual a Hipertensos en Sección A. \")","v":""},{"$f":"IF($Y$34<=$Y$16,\"\",\"* Pacientes 60 a 64 años (Mujeres) con PA<140/90 mmHg debe ser menor o igual a Hipertensos en Sección A. \")","v":""},{"$f":"IF($Z$34<=$Z$16,\"\",\"* Pacientes 65 a 69 años (Hombres) con PA<140/90 mmHg debe ser menor o igual a Hipertensos en Sección A. \")","v":""},{"$f":"IF($AA$34<=$AA$16,\"\",\"* Pacientes 65 a 69 años (Mujeres) con PA<140/90 mmHg debe ser menor o igual a Hipertensos en Sección A. \")","v":""},{"$f":"IF($AB$34<=$AB$16,\"\",\"* Pacientes 70 a 74 años (Hombres) con PA<140/90 mmHg debe ser menor o igual a Hipertensos en Sección A. \")","v":""},{"$f":"IF($AC$34<=$AC$16,\"\",\"* Pacientes 70 a 74 años (Mujeres) con PA<140/90 mmHg debe ser menor o igual a Hipertensos en Sección A. \")","v":""},{"$f":"IF($AD$34<=$AD$16,\"\",\"* Pacientes 75 a 79 años (Hombres) con PA<140/90 mmHg debe ser menor o igual a Hipertensos en Sección A. \")","v":""},{"$f":"IF($AE$34<=$AE$16,\"\",\"* Pacientes 75 a 79 años (Mujeres) con PA<140/90 mmHg debe ser menor o igual a Hipertensos en Sección A. \")","v":""},{"$f":"IF($AF$34<=$AF$16,\"\",\"* Pacientes 80 y más años (Hombres) con PA<140/90 mmHg debe ser menor o igual a Hipertensos en Sección A. \")","v":""},{"$f":"IF($AG$34<=$AG$16,\"\",\"* Pacientes 80 y más años (Mujeres) con PA<140/90 mmHg debe ser menor o igual a Hipertensos en Sección A. \")","v":""},null,null,{"$f":"IF(AND(D34<>0,AH34=\"\"),1,IF(AND(E34<>0,AI34=\"\"),1,0))","v":0},{"$f":"IF(AND(D34<>0,AJ34=\"\"),1,IF(AND(E34<>0,AK34=\"\"),1,0))","v":0},{"$f":"IF($D$34>=$AH$34,0,1)","v":0},{"$f":"IF(E$34>=AI34,0,1)","v":0},{"$f":"IF($D34>=$AJ34,0,1)","v":0},{"$f":"IF(E34>=AK34,0,1)","v":0},{"$f":"IF(F$34<=F$16,0,1)","v":0},0,0,0,0,0,{"$f":"IF(L$34<=L$16,0,1)","v":0},0,0,0,0,0,0,0,0,0,0,0,0,0,0,0,0,0,0,0,0,0]
[null,"PA < 150/90 mmHg ",{"$f":"SUM(D35:E35)","v":0},{"$f":"+AF35","v":0},{"$f":"+AG35","v":0},null,null,null,null,null,null,null,null,null,null,null,null,null,null,null,null,null,null,null,null,null,null,null,null,null,null,null,null,null,null,null,null,{"$f":" BD35 & BE35 & BF35 & BG35 & BB35 & BC35","v":""},null,null,null,null,null,null,null,null,null,null,null,null,null,null,null,{"$f":"IF(AND(D35<>0,AH35=\"\"),\"* No olvide escribir en la celda de Pueblos Originarios Hombres (Digite CERO si no tiene). \",IF(AND(E35<>0,AI35=\"\"),\"* No olvide escribir en la celda de Pueblos Originarios Mujeres (Digite CERO si no tiene). \",\"\"))","v":""},{"$f":"IF(AND(D35<>0,AJ35=\"\"),\"* No olvide escribir en la celda de Población Migrantes Hombres (Digite CERO si no tiene). \",IF(AND(E35<>0,AK35=\"\"),\"* No olvide escribir en la celda de Población Migrantes Mujeres (Digite CERO si no tiene). \",\"\"))","v":""},{"$f":"IF(D35>=AH35,\"\",\"* Pueblos Originarios Hombres no debe ser mayor al Total Hombres. \")","v":""},{"$f":"IF(E35>=AI35,\"\",\"* Pueblos Originarios Mujeres no debe ser mayor al Total Mujeres. \")","v":""},{"$f":"IF(D35>=AJ35,\"\",\"* Población Migrantes Hombres no debe ser mayor al Total Hombres. \")","v":""},{"$f":"IF(E35>=AK35,\"\",\"* Pueblos Originarios Mujeres no debe ser mayor al Total Mujeres. \")","v":""},null,null,null,null,null,null,null,null,null,null,null,null,null,null,null,null,null,null,null,null,null,null,null,null,null,null,null,null,null,null,{"$f":"IF(AND(D35<>0,AH35=\"\"),1,IF(AND(E35<>0,AI35=\"\"),1,0))","v":0},{"$f":"IF(AND(D35<>0,AJ35=\"\"),1,IF(AND(E35<>0,AK35=\"\"),1,0))","v":0},{"$f":"IF($D$35>=$AH$35,0,1)","v":0},{"$f":"IF(E$34>=AI35,0,1)","v":0},0,{"$f":"IF(E35>=AK35,0,1)","v":0}]
["PERSONAS BAJO CONTROL POR DIABETES MELLITUS","HbA1C<7% ",0,{"$f":"+F36+H36+J36+L36+N36+P36+R36+T36+V36+X36+Z36+AB36+AD36","v":0},{"$f":"+G36+I36+K36+M36+O36+Q36+S36+U36+W36+Y36+AA36+AC36+AE36","v":0},null,null,null,null,null,null,null,null,null,null,null,null,null,null,null,null,null,null,null,null,null,null,null,null,null,null,null,null,null,null,null,null,{"$f":" BD36 & BE36 & BH36 & BI36 & BJ36 & BK36 & BL36 & BM36 & BN36 & BO36 & BP36 & BQ36 & BR36 & BS36 & BT36 & BU36 & BV36 & BW36 & BX36 & BY36 & BZ36 & CA36 & CB36 & CC36 & CD36 & CE36 & CF36 & CH36 & CI36 & CG36 & BF36 & BG36 & BB36 & BC36","v":""},null,null,null,null,null,null,null,null,null,null,null,null,null,null,null,"","","","","","",{"$f":"IF($F$36<=$F$17,\"\",\"* Pacientes 15 a 19 años (Hombres) con HbA1C<7% debe ser menor o igual a Diabéticos en Sección A. \")","v":""},{"$f":"IF($G$36<=$G$17,\"\",\"* Pacientes 15 a 19 años (Mujeres) con HbA1C<7% debe ser menor o igual a Diabéticos en Sección A. \")","v":""},{"$f":"IF($H$36<=$H$17,\"\",\"* Pacientes 20 a 24 años (Hombres) con HbA1C<7% debe ser menor o igual a Diabéticos en Sección A. \")","v":""},{"$f":"IF($I$36<=$I$17,\"\",\"* Pacientes 20 a 24 años (Mujeres) con HbA1C<7% debe ser menor o igual a Diabéticos en Sección A. \")","v":""},{"$f":"IF($J$36<=$J$17,\"\",\"* Pacientes 25 a 29 años (Hombres) con HbA1C<7% debe ser menor o igual a Diabéticos en Sección A. \")","v":""},{"$f":"IF($K$36<=$K$17,\"\",\"* Pacientes 25 a 29 años (Mujeres) con HbA1C<7% debe ser menor o igual a Diabéticos en Sección A. \")","v":""},{"$f":"IF($L$36<=$L$17,\"\",\"* Pacientes 30 a 34 años (Hombres) con HbA1C<7% debe ser menor o igual a Diabéticos en Sección A. \")","v":""},{"$f":"IF($M$36<=$M$17,\"\",\"* Pacientes 30 a 34 años (Mujeres) con HbA1C<7% debe ser menor o igual a Diabéticos en Sección A. \")","v":""},{"$f":"IF($N$36<=$N$17,\"\",\"* Pacientes 35 a 39 años (Hombres) con HbA1C<7% debe ser menor o igual a Diabéticos en Sección A. \")","v":""},{"$f":"IF($O$36<=$O$17,\"\",\"* Pacientes 35 a 39 años (Mujeres) con HbA1C<7% debe ser menor o igual a Diabéticos en Sección A. \")","v":""},{"$f":"IF($P$36<=$P$17,\"\",\"* Pacientes 40 a 44 años (Hombres) con HbA1C<7% debe ser menor o igual a Diabéticos en Sección A. \")","v":""},{"$f":"IF($Q$36<=$Q$17,\"\",\"* Pacientes 40 a 44 años (Mujeres) con HbA1C<7% debe ser menor o igual a Diabéticos en Sección A. \")","v":""},{"$f":"IF($R$36<=$R$17,\"\",\"* Pacientes 45 a 49 años (Hombres) con HbA1C<7% debe ser menor o igual a Diabéticos en Sección A. \")","v":""},{"$f":"IF($S$36<=$S$17,\"\",\"* Pacientes 45 a 49 años (Mujeres) con HbA1C<7% debe ser menor o igual a Diabéticos en Sección A. \")","v":""},{"$f":"IF($T$36<=$T$17,\"\",\"* Pacientes 50 a 54 años (Hombres) con HbA1C<7% debe ser menor o igual a Diabéticos en Sección A. \")","v":""},{"$f":"IF($U$36<=$U$17,\"\",\"* Pacientes 50 a 54 años (Mujeres) con HbA1C<7% debe ser menor o igual a Diabéticos en Sección A. \")","v":""},{"$f":"IF($V$36<=$V$17,\"\",\"* Pacientes 55 a 59 años (Hombres) con HbA1C<7% debe ser menor o igual a Diabéticos en Sección A. \")","v":""},{"$f":"IF($W$36<=$W$17,\"\",\"* Pacientes 55 a 59 años (Mujeres) con HbA1C<7% debe ser menor o igual a Diabéticos en Sección A. \")","v":""},{"$f":"IF($X$36<=$X$17,\"\",\"* Pacientes 60 a 64 años (Hombres) con HbA1C<7% debe ser menor o igual a Diabéticos en Sección A. \")","v":""},{"$f":"IF($Y$36<=$Y$17,\"\",\"* Pacientes 60 a 64 años (Mujeres) con HbA1C<7% debe ser menor o igual a Diabéticos en Sección A. \")","v":""},{"$f":"IF($Z$36<=$Z$17,\"\",\"* Pacientes 65 a 69 años (Hombres) con HbA1C<7% debe ser menor o igual a Diabéticos en Sección A. \")","v":""},{"$f":"IF($AA$36<=$AA$17,\"\",\"* Pacientes 65 a 69 años (Mujeres) con HbA1C<7% debe ser menor o igual a Diabéticos en Sección A. \")","v":""},{"$f":"IF($AB$36<=$AB$17,\"\",\"* Pacientes 70 a 74 años (Hombres) con HbA1C<7% debe ser menor o igual a Diabéticos en Sección A. \")","v":""},{"$f":"IF($AC$36<=$AC$17,\"\",\"* Pacientes 70 a 74 años (Mujeres) con HbA1C<7% debe ser menor o igual a Diabéticos en Sección A. \")","v":""},{"$f":"IF($AD$36<=$AD$17,\"\",\"* Pacientes 75 a 79 años (Hombres) con HbA1C<7% debe ser menor o igual a Diabéticos en Sección A. \")","v":""},{"$f":"IF($AE$36<=$AE$17,\"\",\"* Pacientes 75 a 79 años (Mujeres) con HbA1C<7% debe ser menor o igual a Diabéticos en Sección A. \")","v":""},{"$f":"IF($AF$36<=$AF$17,\"\",\"* Pacientes 80 y más años (Hombres) con HbA1C<7% debe ser menor o igual a Diabéticos en Sección A. \")","v":""},{"$f":"IF($AG$37<=$AG$17,\"\",\"* Pacientes 80 y más años (Mujeres) con HbA1C<8% debe ser menor o igual a Diabéticos en Sección A. \")","v":""},null,null,0,0,{"$f":"IF($D$36>=$AH$36,0,1)","v":0},0,0,0,{"$f":"IF(F$36<=F$17,0,1)","v":0},0,0,0,0,0,0,0,0,0,0,0,0,0,0,0,0,0,0,0,0,0,0,0,0,0,0,0]
[null,"HbA1C<8%",0,{"$f":"+AF37","v":0},{"$f":"+AG37","v":0},null,null,null,null,null,null,null,null,null,null,null,null,null,null,null,null,null,null,null,null,null,null,null,null,null,null,null,null,null,null,null,null,{"$f":" BD37 & BE37 & BF37 & BG37 & BB37 & BC37","v":""},null,null,null,null,null,null,null,null,null,null,null,null,null,null,null,"","","","","","",null,null,null,null,null,null,null,null,null,null,null,null,null,null,null,null,null,null,null,null,null,null,null,null,null,null,null,null,null,null,0,0,{"$f":"IF($D$37>=$AH$37,0,1)","v":0},0,{"$f":"IF($D37>=$AJ37,0,1)","v":0},0]
[null,"HbA1C<7% - PA < 140/90mmHg y Colesterol LDL < 100 mg/dl",0,{"$f":"+F38+H38+J38+L38+N38+P38+R38+T38+V38+X38+Z38+AB38+AD38+AF38","v":0},{"$f":"+G38+I38+K38+M38+O38+Q38+S38+U38+W38+Y38+AA38+AC38+AE38+AG38","v":0},null,null,null,null,null,null,null,null,null,null,null,null,null,null,null,null,null,null,null,null,null,null,null,null,null,null,null,null,null,null,null,null,{"$f":" BD38 & BE38 & BH38 & BI38 & BJ38 & BK38 & BL38 & BM38 & BN38 & BO38 & BP38 & BQ38 & BR38 & BS38 & BT38 & BU38 & BV38 & BW38 & BX38 & BY38 & BZ38 & CA38 & CB38 & CC38 & CD38 & CE38 & CF38 & CH38 & CI38 & CG38 & BF38 & BG38 & BB38 & BC38","v":""},null,null,null,null,null,null,null,null,null,null,null,null,null,null,null,"","","","","","",{"$f":"IF($F$38<=$F$36,\"\",\"* Pacientes 15 a 19 años (Hombres) con HbA1C<7% - PA<140/90mmHg debe ser menor o igual a los con HbA1C<7%. \")","v":""},{"$f":"IF($G$38<=$G$36,\"\",\"* Pacientes 15 a 19 años (Mujeres) con HbA1C<7% - PA<140/90mmHg debe ser menor o igual a los con HbA1C<7%. \")","v":""},{"$f":"IF($H$38<=$H$36,\"\",\"* Pacientes 20 a 24 años (Hombres) con HbA1C<7% - PA<140/90mmHg debe ser menor o igual a los con HbA1C<7%. \")","v":""},{"$f":"IF($I$38<=$I$36,\"\",\"* Pacientes 20 a 24 años (Mujeres) con HbA1C<7% - PA<140/90mmHg debe ser menor o igual a los con HbA1C<7%. \")","v":""},{"$f":"IF($J$38<=$J$36,\"\",\"* Pacientes 25 a 29 años (Hombres) con HbA1C<7% - PA<140/90mmHg debe ser menor o igual a los con HbA1C<7%. \")","v":""},{"$f":"IF($K$38<=$K$36,\"\",\"* Pacientes 25 a 29 años (Mujeres) con HbA1C<7% - PA<140/90mmHg debe ser menor o igual a los con HbA1C<7%. \")","v":""},{"$f":"IF($L$38<=$L$36,\"\",\"* Pacientes 30 a 34 años (Hombres) con HbA1C<7% - PA<140/90mmHg debe ser menor o igual a los con HbA1C<7%. \")","v":""},{"$f":"IF($M$38<=$M$36,\"\",\"* Pacientes 30 a 34 años (Mujeres) con HbA1C<7% - PA<140/90mmHg debe ser menor o igual a los con HbA1C<7%. \")","v":""},{"$f":"IF($N$38<=$N$36,\"\",\"* Pacientes 35 a 39 años (Hombres) con HbA1C<7% - PA<140/90mmHg debe ser menor o igual a los con HbA1C<7%. \")","v":""},{"$f":"IF($O$38<=$O$36,\"\",\"* Pacientes 35 a 39 años (Mujeres) con HbA1C<7% - PA<140/90mmHg debe ser menor o igual a los con HbA1C<7%. \")","v":""},{"$f":"IF($P$38<=$P$36,\"\",\"* Pacientes 40 a 44 años (Hombres) con HbA1C<7% - PA<140/90mmHg debe ser menor o igual a los con HbA1C<7%. \")","v":""},{"$f":"IF($Q$38<=$Q$36,\"\",\"* Pacientes 40 a 44 años (Mujeres) con HbA1C<7% - PA<140/90mmHg debe ser menor o igual a los con HbA1C<7%. \")","v":""},{"$f":"IF($R$38<=$R$36,\"\",\"* Pacientes 45 a 49 años (Hombres) con HbA1C<7% - PA<140/90mmHg debe ser menor o igual a los con HbA1C<7%. \")","v":""},{"$f":"IF($S$38<=$S$36,\"\",\"* Pacientes 45 a 49 años (Mujeres) con HbA1C<7% - PA<140/90mmHg debe ser menor o igual a los con HbA1C<7%. \")","v":""},{"$f":"IF($T$38<=$T$36,\"\",\"* Pacientes 50 a 54 años (Hombres) con HbA1C<7% - PA<140/90mmHg debe ser menor o igual a los con HbA1C<7%. \")","v":""},{"$f":"IF($U$38<=$U$36,\"\",\"* Pacientes 50 a 54 años (Mujeres) con HbA1C<7% - PA<140/90mmHg debe ser menor o igual a los con HbA1C<7%. \")","v":""},{"$f":"IF($V$38<=$V$36,\"\",\"* Pacientes 55 a 59 años (Hombres) con HbA1C<7% - PA<140/90mmHg debe ser menor o igual a los con HbA1C<7%. \")","v":""},{"$f":"IF($W$38<=$W$36,\"\",\"* Pacientes 55 a 59 años (Mujeres) con HbA1C<7% - PA<140/90mmHg debe ser menor o igual a los con HbA1C<7%. \")","v":""},{"$f":"IF($X$38<=$X$36,\"\",\"* Pacientes 60 a 64 años (Hombres) con HbA1C<7% - PA<140/90mmHg debe ser menor o igual a los con HbA1C<7%. \")","v":""},{"$f":"IF($Y$38<=$Y$36,\"\",\"* Pacientes 60 a 64 años (Mujeres) con HbA1C<7% - PA<140/90mmHg debe ser menor o igual a los con HbA1C<7%. \")","v":""},{"$f":"IF($Z$38<=$Z$36,\"\",\"* Pacientes 65 a 69 años (Hombres) con HbA1C<7% - PA<140/90mmHg debe ser menor o igual a los con HbA1C<7%. \")","v":""},{"$f":"IF($AA$38<=$AA$36,\"\",\"* Pacientes 65 a 69 años (Mujeres) con HbA1C<7% - PA<140/90mmHg debe ser menor o igual a los con HbA1C<7%. \")","v":""},{"$f":"IF($AB$38<=$AB$36,\"\",\"* Pacientes 70 a 74 años (Hombres) con HbA1C<7% - PA<140/90mmHg debe ser menor o igual a los con HbA1C<7%. \")","v":""},{"$f":"IF($AC$38<=$AC$36,\"\",\"* Pacientes 70 a 74 años (Mujeres) con HbA1C<7% - PA<140/90mmHg debe ser menor o igual a los con HbA1C<7%. \")","v":""},{"$f":"IF($AD$38<=$AD$36,\"\",\"* Pacientes 75 a 79 años (Hombres) con HbA1C<7% - PA<140/90mmHg debe ser menor o igual a los con HbA1C<7%. \")","v":""},{"$f":"IF($AE$38<=$AE$36,\"\",\"* Pacientes 75 a 79 años (Mujeres) con HbA1C<7% - PA<140/70mmHg debe ser menor o igual a los con HbA1C<7%. \")","v":""},null,null,null,null,0,0,{"$f":"IF($D$38>=$AH$38,0,1)","v":0},0,0,0,{"$f":"IF(F$38<=F$36,0,1)","v":0},0,0,0,0,0,0,0,0,0,0,0,0,0,0,0,0,0,0,0,0,0,0,0,0,0]
["PERSONAS CON RCV ALTO","COLESTEROL LDL < 100 mg/dL",0,{"$f":"+F39+H39+J39+L39+N39+P39+R39+T39+V39+X39+Z39+AB39+AD39+AF39","v":0},0,null,null,null,null,null,null,null,null,null,null,null,null,null,null,null,null,null,null,null,null,null,null,null,null,null,null,null,null,null,null,null,null,{"$f":" BD39 & BE39 & BH39 & BI39 & BJ39 & BK39 & BL39 & BM39 & BN39 & BO39 & BP39 & BQ39 & BR39 & BS39 & BT39 & BU39 & BV39 & BW39 & BX39 & BY39 & BZ39 & CA39 & CB39 & CC39 & CD39 & CE39 & CF39 & CH39 & CI39 & CG39 & BF39 & BG39 & BB39 & BC39","v":""},null,null,null,null,null,null,null,null,null,null,null,null,null,null,null,"","","","","","",{"$f":"IF($F$39<=$F$15,\"\",\"* Pacientes 15 a 19 años (Hombres) con RCV Alto con Colesterol LDL <100 mg/dl no debe ser mayor al Total RCV Alto de Sección A. \")","v":""},{"$f":"IF($G$39<=$G$15,\"\",\"* Pacientes 15 a 19 años (Mujeres) con RCV Alto con Colesterol LDL <100 mg/dl no debe ser mayor al Total RCV Alto de Sección A. \")","v":""},{"$f":"IF($H$39<=+$H$15,\"\",\"* Pacientes 20 a 24 años (Hombres) con RCV Alto con Colesterol LDL <100 mg/dl no debe ser mayor al Total RCV Alto de Sección A. \")","v":""},{"$f":"IF($I$39<=+$I$15,\"\",\"* Pacientes 20 a 24 años (Mujeres) con RCV Alto con Colesterol LDL <100 mg/dl no debe ser mayor al Total RCV Alto de Sección A. \")","v":""},{"$f":"IF($J$39<=+$J$15,\"\",\"* Pacientes 25 a 29 años (Hombres) con RCV Alto con Colesterol LDL <100 mg/dl no debe ser mayor al Total RCV Alto de Sección A. \")","v":""},{"$f":"IF($K$39<=+$K$15,\"\",\"* Pacientes 25 a 29 años (Mujeres) con RCV Alto con Colesterol LDL <100 mg/dl no debe ser mayor al Total RCV Alto de Sección A. \")","v":""},{"$f":"IF($L$39<=+$L$15,\"\",\"* Pacientes 30 a 34 años (Hombres) con RCV Alto con Colesterol LDL <100 mg/dl no debe ser mayor al Total RCV Alto de Sección A. \")","v":""},{"$f":"IF($M$39<=+$M$15,\"\",\"* Pacientes 30 a 34 años (Mujeres) con RCV Alto con Colesterol LDL <100 mg/dl no debe ser mayor al Total RCV Alto de Sección A. \")","v":""},{"$f":"IF($N$39<=+$N$15,\"\",\"* Pacientes 35 a 39 años (Hombres) con RCV Alto con Colesterol LDL <100 mg/dl no debe ser mayor al Total RCV Alto de Sección A. \")","v":""},{"$f":"IF($O$39<=+$O$15,\"\",\"* Pacientes 35 a 39 años (Mujeres) con RCV Alto con Colesterol LDL <100 mg/dl no debe ser mayor al Total RCV Alto de Sección A. \")","v":""},{"$f":"IF($P$39<=+$P$15,\"\",\"* Pacientes 40 a 44 años (Hombres) con RCV Alto con Colesterol LDL <100 mg/dl no debe ser mayor al Total RCV Alto de Sección A. \")","v":""},{"$f":"IF($Q$39<=+$Q$15,\"\",\"* Pacientes 40 a 44 años (Mujeres) con RCV Alto con Colesterol LDL <100 mg/dl no debe ser mayor al Total RCV Alto de Sección A. \")","v":""},{"$f":"IF($R$39<=+$R$15,\"\",\"* Pacientes 45 a 49 años (Hombres) con RCV Alto con Colesterol LDL <100 mg/dl no debe ser mayor al Total RCV Alto de Sección A. \")","v":""},{"$f":"IF($S$39<=+$S$15,\"\",\"* Pacientes 45 a 49 años (Mujeres) con RCV Alto con Colesterol LDL <100 mg/dl no debe ser mayor al Total RCV Alto de Sección A. \")","v":""},{"$f":"IF($T$39<=+$T$15,\"\",\"* Pacientes 50 a 54 años (Hombres) con RCV Alto con Colesterol LDL <100 mg/dl no debe ser mayor al Total RCV Alto de Sección A. \")","v":""},{"$f":"IF($U$39<=+$U$15,\"\",\"* Pacientes 50 a 54 años (Mujeres) con RCV Alto con Colesterol LDL <100 mg/dl no debe ser mayor al Total RCV Alto de Sección A. \")","v":""},{"$f":"IF($V$39<=+$V$15,\"\",\"* Pacientes 55 a 59 años (Hombres) con RCV Alto con Colesterol LDL <100 mg/dl no debe ser mayor al Total RCV Alto de Sección A. \")","v":""},{"$f":"IF($W$39<=+$W$15,\"\",\"* Pacientes 55 a 59 años (Mujeres) con RCV Alto con Colesterol LDL <100 mg/dl no debe ser mayor al Total RCV Alto de Sección A. \")","v":""},{"$f":"IF($X$39<=+$X$15,\"\",\"* Pacientes 60 a 64 años (Hombres) con RCV Alto con Colesterol LDL <100 mg/dl no debe ser mayor al Total RCV Alto de Sección A. \")","v":""},{"$f":"IF($Y$39<=+$Y$15,\"\",\"* Pacientes 60 a 64 años (Mujeres) con RCV Alto con Colesterol LDL <100 mg/dl no debe ser mayor al Total RCV Alto de Sección A. \")","v":""},{"$f":"IF($Z$39<=+$Z$15,\"\",\"* Pacientes 65 a 69 años (Hombres) con RCV Alto con Colesterol LDL <100 mg/dl no debe ser mayor al Total RCV Alto de Sección A. \")","v":""},{"$f":"IF($AA$39<=+$AA$15,\"\",\"* Pacientes 65 a 69 años (Mujeres) con RCV Alto con Colesterol LDL <100 mg/dl no debe ser mayor al Total RCV Alto de Sección A. \")","v":""},{"$f":"IF($AB$39<=+$AB$15,\"\",\"* Pacientes 70 a 74 años (Hombres) con RCV Alto con Colesterol LDL <100 mg/dl no debe ser mayor al Total RCV Alto de Sección A. \")","v":""},{"$f":"IF($AC$39<=+$AC$15,\"\",\"* Pacientes 70 a 74 años (Mujeres) con RCV Alto con Colesterol LDL <100 mg/dl no debe ser mayor al Total RCV Alto de Sección A. \")","v":""},{"$f":"IF($AD$39<=+$AD$15,\"\",\"* Pacientes 75 a 79 años (Hombres) con RCV Alto con Colesterol LDL <100 mg/dl no debe ser mayor al Total RCV Alto de Sección A. \")","v":""},{"$f":"IF($AE$39<=+$AE$15,\"\",\"* Pacientes 75 a 79 años (Mujeres) con RCV Alto con Colesterol LDL <100 mg/dl no debe ser mayor al Total RCV Alto de Sección A. \")","v":""},{"$f":"IF($AF$39<=+$AF$15,\"\",\"* Pacientes 80 y más años (Hombres) con RCV Alto con Colesterol LDL <100 mg/dl no debe ser mayor al Total RCV Alto de Sección A. \")","v":""},{"$f":"IF($AG$39<=+$AG$15,\"\",\"* Pacientes 80 y más años (Mujeres) con RCV Alto con Colesterol LDL <100 mg/dl no debe ser mayor al Total RCV Alto de Sección A. \")","v":""},null,null,0,0,{"$f":"IF($D$39>=$AH$39,0,1)","v":0},0,0,0,{"$f":"IF(F$39<=+F$15,0,1)","v":0},0,0,0,0,0,0,0,0,0,0,0,0,0,0,0,0,0,0,0,0,0,0,0,0,0,0,0]
["PERSONAS BAJO CONTROL con antecedentes Enfermedad Cardiovascular (ECV)","En tratamiento con Antiagregantes plaquetarios",0,0,0,null,null,null,null,null,null,null,null,null,null,null,null,null,null,null,null,null,null,null,null,null,null,null,null,null,null,null,null,null,null,null,null,{"$f":" BD40 & BE40 & BH40 & BI40 & BJ40 & BK40 & BL40 & BM40 & BN40 & BO40 & BP40 & BQ40 & BR40 & BS40 & BT40 & BU40 & BV40 & BW40 & BX40 & BY40 & BZ40 & CA40 & CB40 & CC40 & CD40 & CE40 & CF40 & CH40 & CI40 & CG40 & BF40 & BG40 & BB40 & BC40","v":""},null,null,null,null,null,null,null,null,null,null,null,null,null,null,null,"","","","","","",{"$f":"IF($F$40<=$F$20+$F$21,\"\",\"* Pacientes 15 a 19 años (Hombres) con con antecedentes ECV con tto. Antiagregante plaquetario no debe ser mayor al Total Población con Antecedentes de IAM y ECV de Sección A. \")","v":""},{"$f":"IF($G$40<=$G$20+$G$21,\"\",\"* Pacientes 15 a 19 años (Mujeres) con con antecedentes ECV con tto. Antiagregante plaquetario no debe ser mayor al Total Población con Antecedentes de IAM y ECV de Sección A. \")","v":""},{"$f":"IF($H$40<=$H$20+$H$21,\"\",\"* Pacientes 20 a 24 años (Hombres) con con antecedentes ECV con tto. Antiagregante plaquetario no debe ser mayor al Total Población con Antecedentes de IAM y ECV de Sección A. \")","v":""},{"$f":"IF($I$40<=$I$20+$I$21,\"\",\"* Pacientes 20 a 24 años (Mujeres) con con antecedentes ECV con tto. Antiagregante plaquetario no debe ser mayor al Total Población con Antecedentes de IAM y ECV de Sección A. \")","v":""},{"$f":"IF($J$40<=$J$20+$J$21,\"\",\"* Pacientes 25 a 29 años (Hombres) con con antecedentes ECV con tto. Antiagregante plaquetario no debe ser mayor al Total Población con Antecedentes de IAM y ECV de Sección A. \")","v":""},{"$f":"IF($K$40<=$K$20+$K$21,\"\",\"* Pacientes 25 a 29 años (Mujeres) con con antecedentes ECV con tto. Antiagregante plaquetario no debe ser mayor al Total Población con Antecedentes de IAM y ECV de Sección A. \")","v":""},{"$f":"IF($L$40<=$L$20+$L$21,\"\",\"* Pacientes 30 a 34 años (Hombres) con con antecedentes ECV con tto. Antiagregante plaquetario no debe ser mayor al Total Población con Antecedentes de IAM y ECV de Sección A. \")","v":""},{"$f":"IF($M$40<=$M$20+$M$21,\"\",\"* Pacientes 30 a 34 años (Mujeres) con con antecedentes ECV con tto. Antiagregante plaquetario no debe ser mayor al Total Población con Antecedentes de IAM y ECV de Sección A. \")","v":""},{"$f":"IF($N$40<=$N$20+$N$21,\"\",\"* Pacientes 35 a 39 años (Hombres) con con antecedentes ECV con tto. Antiagregante plaquetario no debe ser mayor al Total Población con Antecedentes de IAM y ECV de Sección A. \")","v":""},{"$f":"IF($O$40<=$O$20+$O$21,\"\",\"* Pacientes 35 a 39 años (Mujeres) con con antecedentes ECV con tto. Antiagregante plaquetario no debe ser mayor al Total Población con Antecedentes de IAM y ECV de Sección A. \")","v":""},{"$f":"IF($P$40<=$P$20+$P$21,\"\",\"* Pacientes 40 a 44 años (Hombres) con con antecedentes ECV con tto.Antiagregante plaquetario no debe ser mayor al Total Población con Antecedentes de IAM y ECV de Sección A. \")","v":""},{"$f":"IF($Q$40<=$Q$20+$Q$21,\"\",\"* Pacientes 40 a 44 años (Mujeres) con con antecedentes ECV con tto. Antiagregante plaquetario no debe ser mayor al Total Población con Antecedentes de IAM y ECV de Sección A. \")","v":""},{"$f":"IF($R$40<=$R$20+$R$21,\"\",\"* Pacientes 45 a 49 años (Hombres) con con antecedentes ECV con tto.Antiagregante plaquetario no debe ser mayor al Total Población con Antecedentes de IAM y ECV de Sección A. \")","v":""},{"$f":"IF($S$40<=$S$20+$S$21,\"\",\"* Pacientes 45 a 49 años (Mujeres) con con antecedentes ECV con tto. Antiagregante plaquetario no debe ser mayor al Total Población con Antecedentes de IAM y ECV de Sección A. \")","v":""},{"$f":"IF($T$40<=$T$20+$T$21,\"\",\"* Pacientes 50 a 54 años (Hombres) con con antecedentes ECV con tto. Antiagregante plaquetario no debe ser mayor al Total Población con Antecedentes de IAM y ECV de Sección A. \")","v":""},{"$f":"IF($U$40<=$U$20+$U$21,\"\",\"* Pacientes 50 a 54 años (Mujeres) con con antecedentes ECV con tto. Antiagregante plaquetario no debe ser mayor al Total Población con Antecedentes de IAM y ECV de Sección A. \")","v":""},{"$f":"IF($V$40<=$V$20+$V$21,\"\",\"* Pacientes 55 a 59 años (Hombres) con con antecedentes ECV con tto. Antiagregante plaquetario no debe ser mayor al Total Población con Antecedentes de IAM y ECV de Sección A. \")","v":""},{"$f":"IF($W$40<=$W$20+$W$21,\"\",\"* Pacientes 55 a 59 años (Mujeres) con con antecedentes ECV con tto. Antiagregante plaquetario no debe ser mayor al Total Población con Antecedentes de IAM y ECV de Sección A. \")","v":""},{"$f":"IF($X$40<=$X$20+$X$21,\"\",\"* Pacientes 60 a 64 años (Hombres) con con antecedentes ECV con tto. Antiagregante plaquetario no debe ser mayor al Total Población con Antecedentes de IAM y ECV de Sección A. \")","v":""},{"$f":"IF($Y$40<=$Y$20+$Y$21,\"\",\"* Pacientes 60 a 64 años (Mujeres) con con antecedentes ECV con tto. Antiagregante plaquetario no debe ser mayor al Total Población con Antecedentes de IAM y ECV de Sección A. \")","v":""},{"$f":"IF($Z$40<=$Z$20+$Z$21,\"\",\"* Pacientes 65 a 69 años (Hombres) con con antecedentes ECV con tto. Antiagregante plaquetario no debe ser mayor al Total Población con Antecedentes de IAM y ECV de Sección A. \")","v":""},{"$f":"IF($AA$40<=$AA$20+$AA$21,\"\",\"* Pacientes 65 a 69 años (Mujeres) con con antecedentes ECV con tto. Antiagregante plaquetario no debe ser mayor al Total Población con Antecedentes de IAM y ECV de Sección A. \")","v":""},{"$f":"IF($AB$40<=$AB$20+$AB$21,\"\",\"* Pacientes 70 a 74 años (Hombres) con con antecedentes ECV con tto. Antiagregante plaquetario no debe ser mayor al Total Población con Antecedentes de IAM y ECV de Sección A. \")","v":""},{"$f":"IF($AC$40<=$AC$20+$AC$21,\"\",\"* Pacientes 70 a 74 años (Mujeres) con con antecedentes ECV con tto. Antiagregante plaquetario no debe ser mayor al Total Población con Antecedentes de IAM y ECV de Sección A. \")","v":""},{"$f":"IF($AD$40<=$AD$20+$AD$21,\"\",\"* Pacientes 75 a 79 años (Hombres) con con antecedentes ECV con tto. Antiagregante plaquetario no debe ser mayor al Total Población con Antecedentes de IAM y ECV de Sección A. \")","v":""},{"$f":"IF($AE$40<=$AE$20+$AE$21,\"\",\"* Pacientes 75 a 79 años (Mujeres) con con antecedentes ECV con tto. Antiagregante plaquetario no debe ser mayor al Total Población con Antecedentes de IAM y ECV de Sección A. \")","v":""},{"$f":"IF($AF$40<=$AF$20+$AF$21,\"\",\"* Pacientes 80 y más años (Hombres) con con antecedentes ECV con tto. Antiagregante plaquetario no debe ser mayor al Total Población con Antecedentes de IAM y ECV de Sección A. \")","v":""},{"$f":"IF($AG$40<=$AG$20+$AG$21,\"\",\"* Pacientes 80 y más años (Mujeres) con con antecedentes ECV con tto. Antiagregante plaquetario no debe ser mayor al Total Población con Antecedentes de IAM y ECV de Sección A. \")","v":""},null,null,0,0,{"$f":"IF($D$40>=$AH$40,0,1)","v":0},0,0,0,{"$f":"IF(F40<=F$20+F$21,0,1)","v":0},0,0,0,0,0,0,0,0,0,{"$f":"IF(P40<=P$20+P$21,0,1)","v":0},0,0,0,0,0,0,0,0,0,{"$f":"IF(Z40<=Z$20+Z$21,0,1)","v":0},0,0,0,0,0,0,0]
[null,"En tratamiento con Estatina",{"$f":"SUM(D41:E41)","v":0},{"$f":"+F41+H41+J41+L41+N41+P41+R41+T41+V41+X41+Z41+AB41+AD41+AF41","v":0},{"$f":"+G41+I41+K41+M41+O41+Q41+S41+U41+W41+Y41+AA41+AC41+AE41+AG41","v":0},null,null,null,null,null,null,null,null,null,null,null,null,null,null,null,null,null,null,null,null,null,null,null,null,null,null,null,null,null,null,null,null,{"$f":" BD41 & BE41 & BH41 & BI41 & BJ41 & BK41 & BL41 & BM41 & BN41 & BO41 & BP41 & BQ41 & BR41 & BS41 & BT41 & BU41 & BV41 & BW41 & BX41 & BY41 & BZ41 & CA41 & CB41 & CC41 & CD41 & CE41 & CF41 & CH41 & CI41 & CG41 & BF41 & BG41 & BB41 & BC41","v":""},null,null,null,null,null,null,null,null,null,null,null,null,null,null,null,"","","","","","",{"$f":"IF($F41<=$F$20+$F$21,\"\",\"* Pacientes 15 a 19 años (Hombres) con con antecedentes ECV con Estatina no debe ser mayor al Total Población con Antecedentes de IAM y ECV de Sección A. \")","v":""},{"$f":"IF($G41<=$G$20+$G$21,\"\",\"* Pacientes 15 a 19 años (Mujeres) con con antecedentes ECV con Estatina no debe ser mayor al Total Población con Antecedentes de IAM y ECV de Sección A. \")","v":""},{"$f":"IF($H41<=$H$20+$H$21,\"\",\"* Pacientes 20 a 24 años (Hombres) con con antecedentes ECV con Estatina no debe ser mayor al Total Población con Antecedentes de IAM y ECV de Sección A. \")","v":""},{"$f":"IF($I41<=$I$20+$I$21,\"\",\"* Pacientes 20 a 24 años (Mujeres) con con antecedentes ECV con Estatina no debe ser mayor al Total Población con Antecedentes de IAM y ECV de Sección A. \")","v":""},{"$f":"IF($J41<=$J$20+$J$21,\"\",\"* Pacientes 25 a 29 años (Hombres) con con antecedentes ECV con Estatina no debe ser mayor al Total Población con Antecedentes de IAM y ECV de Sección A. \")","v":""},{"$f":"IF($K41<=$K$20+$K$21,\"\",\"* Pacientes 25 a 29 años (Mujeres) con con antecedentes ECV con Estatina no debe ser mayor al Total Población con Antecedentes de IAM y ECV de Sección A. \")","v":""},{"$f":"IF($L41<=$L$20+$L$21,\"\",\"* Pacientes 30 a 34 años (Hombres) con con antecedentes ECV con Estatina no debe ser mayor al Total Población con Antecedentes de IAM y ECV de Sección A. \")","v":""},{"$f":"IF($M41<=$M$20+$M$21,\"\",\"* Pacientes 30 a 34 años (Mujeres) con con antecedentes ECV con Estatina no debe ser mayor al Total Población con Antecedentes de IAM y ECV de Sección A. \")","v":""},{"$f":"IF($N41<=$N$20+$N$21,\"\",\"* Pacientes 35 a 39 años (Hombres) con con antecedentes ECV con Estatina no debe ser mayor al Total Población con Antecedentes de IAM y ECV de Sección A. \")","v":""},{"$f":"IF($O41<=$O$20+$O$21,\"\",\"* Pacientes 35 a 39 años (Mujeres) con con antecedentes ECV con Estatina no debe ser mayor al Total Población con Antecedentes de IAM y ECV de Sección A. \")","v":""},{"$f":"IF($P41<=$P$20+$P$21,\"\",\"* Pacientes 40 a 44 años (Hombres) con con antecedentes ECV con Estatina no debe ser mayor al Total Población con Antecedentes de IAM y ECV de Sección A. \")","v":""},{"$f":"IF($Q41<=$Q$20+$Q$21,\"\",\"* Pacientes 40 a 44 años (Mujeres) con con antecedentes ECV con Estatina no debe ser mayor al Total Población con Antecedentes de IAM y ECV de Sección A. \")","v":""},{"$f":"IF($R41<=$R$20+$R$21,\"\",\"* Pacientes 45 a 49 años (Hombres) con con antecedentes ECV con Estatina no debe ser mayor al Total Población con Antecedentes de IAM y ECV de Sección A. \")","v":""},{"$f":"IF($S41<=$S$20+$S$21,\"\",\"* Pacientes 45 a 49 años (Mujeres) con con antecedentes ECV con Estatina no debe ser mayor al Total Población con Antecedentes de IAM y ECV de Sección A. \")","v":""},{"$f":"IF($T41<=$T$20+$T$21,\"\",\"* Pacientes 50 a 54 años (Hombres) con con antecedentes ECV con Estatina no debe ser mayor al Total Población con Antecedentes de IAM y ECV de Sección A. \")","v":""},{"$f":"IF($U41<=$U$20+$U$21,\"\",\"* Pacientes 50 a 54 años (Mujeres) con con antecedentes ECV con Estatina no debe ser mayor al Total Población con Antecedentes de IAM y ECV de Sección A. \")","v":""},{"$f":"IF($V41<=$V$20+$V$21,\"\",\"* Pacientes 55 a 59 años (Hombres) con con antecedentes ECV con Estatina no debe ser mayor al Total Población con Antecedentes de IAM y ECV de Sección A. \")","v":""},{"$f":"IF($W41<=$W$20+$W$21,\"\",\"* Pacientes 55 a 59 años (Mujeres) con con antecedentes ECV con Estatina no debe ser mayor al Total Población con Antecedentes de IAM y ECV de Sección A. \")","v":""},{"$f":"IF($X41<=$X$20+$X$21,\"\",\"* Pacientes 60 a 64 años (Hombres) con con antecedentes ECV con Estatina no debe ser mayor al Total Población con Antecedentes de IAM y ECV de Sección A. \")","v":""},{"$f":"IF($Y41<=$Y$20+$Y$21,\"\",\"* Pacientes 60 a 64 años (Mujeres) con con antecedentes ECV con Estatina no debe ser mayor al Total Población con Antecedentes de IAM y ECV de Sección A. \")","v":""},{"$f":"IF($Z41<=$Z$20+$Z$21,\"\",\"* Pacientes 65 a 69 años (Hombres) con con antecedentes ECV con Estatina no debe ser mayor al Total Población con Antecedentes de IAM y ECV de Sección A. \")","v":""},{"$f":"IF($AA41<=$AA$20+$AA$21,\"\",\"* Pacientes 65 a 69 años (Mujeres) con con antecedentes ECV con Estatina no debe ser mayor al Total Población con Antecedentes de IAM y ECV de Sección A. \")","v":""},{"$f":"IF($AB41<=$AB$20+$AB$21,\"\",\"* Pacientes 70 a 74 años (Hombres) con con antecedentes ECV con Estatina no debe ser mayor al Total Población con Antecedentes de IAM y ECV de Sección A. \")","v":""},{"$f":"IF($AC41<=$AC$20+$AC$21,\"\",\"* Pacientes 70 a 74 años (Mujeres) con con antecedentes ECV con Estatina no debe ser mayor al Total Población con Antecedentes de IAM y ECV de Sección A. \")","v":""},{"$f":"IF($AD41<=$AD$20+$AD$21,\"\",\"* Pacientes 75 a 79 años (Hombres) con con antecedentes ECV con Estatina no debe ser mayor al Total Población con Antecedentes de IAM y ECV de Sección A. \")","v":""},{"$f":"IF($AE41<=$AE$20+$AE$21,\"\",\"* Pacientes 75 a 79 años (Mujeres) con con antecedentes ECV con Estatina no debe ser mayor al Total Población con Antecedentes de IAM y ECV de Sección A. \")","v":""},{"$f":"IF($AF41<=$AF$20+$AF$21,\"\",\"* Pacientes 80 y más años (Hombres) con con antecedentes ECV con Estatina no debe ser mayor al Total Población con Antecedentes de IAM y ECV de Sección A. \")","v":""},{"$f":"IF($AG41<=$AG$20+$AG$21,\"\",\"* Pacientes 80 y más años (Mujeres) con con antecedentes ECV con Estatina no debe ser mayor al Total Población con Antecedentes de IAM y ECV de Sección A. \")","v":""},null,null,{"$f":"IF(AND(D41<>0,AH41=\"\"),1,IF(AND(E41<>0,AI41=\"\"),1,0))","v":0},{"$f":"IF(AND(D41<>0,AJ41=\"\"),1,IF(AND(E41<>0,AK41=\"\"),1,0))","v":0},{"$f":"IF($D$42>=$AH$42,0,1)","v":0},0,0,0,0,0,0,0,0,0,0,0,0,0,0,0,0,0,0,0,0,0,0,0,0,0,0,0,0,0,0,0]
[null,"Fumador actual",{"$f":"SUM(D42:E42)","v":0},{"$f":"+F42+H42+J42+L42+N42+P42+R42+T42+V42+X42+Z42+AB42+AD42+AF42","v":0},{"$f":"+G42+I42+K42+M42+O42+Q42+S42+U42+W42+Y42+AA42+AC42+AE42+AG42","v":0},null,null,null,null,null,null,null,null,null,null,null,null,null,null,null,null,null,null,null,null,null,null,null,null,null,null,null,null,null,null,null,null,{"$f":" BD42 & BE42 & BH42 & BI42 & BJ42 & BK42 & BL42 & BM42 & BN42 & BO42 & BP42 & BQ42 & BR42 & BS42 & BT42 & BU42 & BV42 & BW42 & BX42 & BY42 & BZ42 & CA42 & CB42 & CC42 & CD42 & CE42 & CF42 & CH42 & CI42 & CG42 & BG42 & BF42 & BB42 & BC42","v":""},null,null,null,null,null,null,null,null,null,null,null,null,null,null,null,"","","","","","",null,null,null,null,null,null,null,null,null,null,null,null,null,null,null,null,null,null,null,null,null,null,null,null,null,null,null,null,null,null,0,0,{"$f":"IF($D$42>=$AH$42,0,1)","v":0},0,0,0]
["SECCIÓN C: VARIABLES DE SEGUIMIENTO DEL PSCV AL CORTE"]
["VARIABLES",null,"TOTAL ",null,null,"GRUPOS DE EDAD (en años) Y SEXO",null,null,null,null,null,null,null,null,null,null,null,null,null,null,null,null,null,null,null,null,null,null,null,null,null,null,null,"Pueblos Originarios",null," Migrantes",null,null,null,null,null,null,null,null,null,null,null,null,null,null,null,null,null,null,null,"Pueblos Originarios",null,"Población Migrantes",null,null,null,"Pueblos Originarios","Población Migrantes",null,null,null,null,null,null,null,null,null,null,null,null,null,null,null,null,null,null,null,null,null,null,null,null,null,null,null,null,"Pueblos Originarios",null,"Población Migrantes",null,null,null,null,null,"Pueblos Originarios","Población Migrantes"]
[null,null,null,null,null,"15 a 19 años",null,"20 a 24 años",null,"25 a 29 años",null,"30 a 34 años",null,"35 a 39 años",null,"40 a 44 años",null,"45 a 49 años",null,"50 a 54 años",null,"55 a 59 años",null,"60 a 64 años",null,"65 a 69 años",null,"70 a 74 años",null,"75 a 79 años",null,"80 y más años"]
[null,null,"Ambos\nsexos","Hombres","Mujeres","Hombres","Mujeres","Hombres","Mujeres","Hombres","Mujeres","Hombres","Mujeres","Hombres","Mujeres","Hombres","Mujeres","Hombres","Mujeres","Hombres","Mujeres","Hombres","Mujeres","Hombres","Mujeres","Hombres ","Mujeres","Hombres ","Mujeres","Hombres ","Mujeres","Hombres ","Mujeres","Hombres","Mujeres","Hombres","Mujeres",null,null,null,null,null,null,null,null,null,null,null,null,null,null,null,null,null,null,"Hombres","Mujeres","Hombres","Mujeres",null,null,"No Olvide","No Olvide",null,null,null,null,null,null,null,null,null,null,null,null,null,null,null,null,null,null,null,null,null,null,null,null,null,null,null,null,"Hombres","Mujeres","Hombres","Mujeres",null,null,null,null,"No Olvide","No Olvide"]
["PERSONAS CON DIABETES  EN PSCV"]
["CON RAZON ALBÚMINA CREATININA (RAC),VIGENTE",null,{"$f":"SUM(D48:E48)","v":0},{"$f":"+F48+H48+J48+L48+N48+P48+R48+T48+V48+X48+Z48+AB48+AD48+AF48","v":0},{"$f":"+G48+I48+K48+M48+O48+Q48+S48+U48+W48+Y48+AA48+AC48+AE48+AG48","v":0},null,null,null,null,null,null,null,null,null,null,null,null,null,null,null,null,null,null,null,null,null,null,null,null,null,null,null,null,null,null,null,null,{"$f":"BD48&BE48&BF48&BG48&BJ48&BK48","v":""},null,null,null,null,null,null,null,null,null,null,null,null,null,null,null,null,null,{"$f":"IF(D48>=AH48,\"\",\"* Pueblos Originarios Hombres no debe ser mayor al Total Hombres. \")","v":""},{"$f":"IF(E48>=AI48,\"\",\"* Pueblos Originarios Mujeres no debe ser mayor al Total Mujeres. \")","v":""},{"$f":"IF(D48>=AJ48,\"\",\"* Población Migrantes Hombres no debe ser mayor al Total Hombres. \")","v":""},{"$f":"IF(E48>=AK48,\"\",\"* Población Migrantes Mujeres no debe ser mayor al Total Mujeres. \")","v":""},null,null,{"$f":"IF(AND(D48<>0,AH48=\"\"),\"* No olvide escribir en la celda de Pueblos Originarios Hombres (Digite CERO si no tiene). \",IF(AND(E48<>0,AI48=\"\"),\"* No olvide escribir en la celda de Pueblos Originarios Mujeres (Digite CERO si no tiene). \",\"\"))","v":""},{"$f":"IF(AND(D48<>0,AJ48=\"\"),\"* No olvide escribir en la celda de Población Migrantes Hombres (Digite CERO si no tiene). \",IF(AND(E48<>0,AK48=\"\"),\"* No olvide escribir en la celda de Población Migrantes Mujeres (Digite CERO si no tiene). \",\"\"))","v":""},null,null,null,null,null,null,null,null,null,null,null,null,null,null,null,null,null,null,null,null,null,null,null,null,null,null,null,null,{"$f":"IF($D48>=$AH48,0,1)","v":0},{"$f":"IF($E48>=$AI48,0,1)","v":0},{"$f":"IF($D48>=$AJ48,0,1)","v":0},{"$f":"IF($E48>=$AK48,0,1)","v":0},null,null,null,null,{"$f":"IF(AND(D48<>0,AH48=\"\"),1,IF(AND(E48<>0,AI48=\"\"),1,0))","v":0},{"$f":"IF(AND(D48<>0,AJ48=\"\"),1,IF(AND(E48<>0,AK48=\"\"),1,0))","v":0}]
["CON VELOCIDAD DE FILTRACIÓN GLOMERULAR ESTIMADA (VFG), VIGENTE",null,{"$f":"SUM(D49:E49)","v":0},{"$f":"+F49+H49+J49+L49+N49+P49+R49+T49+V49+X49+Z49+AB49+AD49+AF49","v":0},{"$f":"+G49+I49+K49+M49+O49+Q49+S49+U49+W49+Y49+AA49+AC49+AE49+AG49","v":0},null,null,null,null,null,null,null,null,null,null,null,null,null,null,null,null,null,null,null,null,null,null,null,null,null,null,null,null,null,null,null,null,{"$f":"BD49&BE49&BF49&BG49&BJ49&BK49","v":""},null,null,null,null,null,null,null,null,null,null,null,null,null,null,null,null,null,{"$f":"IF(D49>=AH49,\"\",\"* Pueblos Originarios Hombres no debe ser mayor al Total Hombres. \")","v":""},{"$f":"IF(E49>=AI49,\"\",\"* Pueblos Originarios Mujeres no debe ser mayor al Total Mujeres. \")","v":""},{"$f":"IF(D49>=AJ49,\"\",\"* Población Migrantes Hombres no debe ser mayor al Total Hombres. \")","v":""},{"$f":"IF(E49>=AK49,\"\",\"* Población Migrantes Mujeres no debe ser mayor al Total Mujeres. \")","v":""},null,null,{"$f":"IF(AND(D49<>0,AH49=\"\"),\"* No olvide escribir en la celda de Pueblos Originarios Hombres (Digite CERO si no tiene). \",IF(AND(E49<>0,AI49=\"\"),\"* No olvide escribir en la celda de Pueblos Originarios Mujeres (Digite CERO si no tiene). \",\"\"))","v":""},{"$f":"IF(AND(D49<>0,AJ49=\"\"),\"* No olvide escribir en la celda de Población Migrantes Hombres (Digite CERO si no tiene). \",IF(AND(E49<>0,AK49=\"\"),\"* No olvide escribir en la celda de Población Migrantes Mujeres (Digite CERO si no tiene). \",\"\"))","v":""},null,null,null,null,null,null,null,null,null,null,null,null,null,null,null,null,null,null,null,null,null,null,null,null,null,null,null,null,{"$f":"IF($D49>=$AH49,0,1)","v":0},{"$f":"IF($E49>=$AI49,0,1)","v":0},{"$f":"IF($D49>=$AJ49,0,1)","v":0},{"$f":"IF($E49>=$AK49,0,1)","v":0},null,null,null,null,{"$f":"IF(AND(D49<>0,AH49=\"\"),1,IF(AND(E49<>0,AI49=\"\"),1,0))","v":0},{"$f":"IF(AND(D49<>0,AJ49=\"\"),1,IF(AND(E49<>0,AK49=\"\"),1,0))","v":0}]
["CON VELOCIDAD DE FILTRACIÓN GLOMERULAR ESTIMADA (VFGe) Y CON RAZON ALBÚMINA CREATININA (RAC) VIGENTE",null,{"$f":"SUM(D50:E50)","v":0},{"$f":"+F50+H50+J50+L50+N50+P50+R50+T50+V50+X50+Z50+AB50+AD50+AF50","v":0},{"$f":"+G50+I50+K50+M50+O50+Q50+S50+U50+W50+Y50+AA50+AC50+AE50+AG50","v":0},null,null,null,null,null,null,null,null,null,null,null,null,null,null,null,null,null,null,null,null,null,null,null,null,null,null,null,null,null,null,null,null,"",null,null,null,null,null,null,null,null,null,null,null,null,null,null,null,null,null,"","","","",null,null,"","",null,null,null,null,null,null,null,null,null,null,null,null,null,null,null,null,null,null,null,null,null,null,null,null,null,null,null,null,0,0,0,0,null,null,null,null,0,0]
["CON FONDO DE OJO, VIGENTE",null,0,0,0,null,null,null,null,null,null,null,null,null,null,null,null,null,null,null,null,null,null,null,null,null,null,null,null,null,null,null,null,null,null,null,null,"",null,null,null,null,null,null,null,null,null,null,null,null,null,null,null,null,null,"","","","",null,null,"","",null,null,null,null,null,null,null,null,null,null,null,null,null,null,null,null,null,null,null,null,null,null,null,null,null,null,null,null,0,0,0,0,null,null,null,null,0,0]
["CON ATENCIÓN PODOLÓGICA VIGENTE",null,0,0,0,null,null,null,null,null,null,null,null,null,null,null,null,null,null,null,null,null,null,null,null,null,null,null,null,null,null,null,null,null,null,null,null,"",null,null,null,null,null,null,null,null,null,null,null,null,null,null,null,null,null,"","","","",null,null,"","",null,null,null,null,null,null,null,null,null,null,null,null,null,null,null,null,null,null,null,null,null,null,null,null,null,null,null,null,0,0,0,0,null,null,null,null,0,0]
["CON ECG VIGENTE",null,0,0,0,null,null,null,null,null,null,null,null,null,null,null,null,null,null,null,null,null,null,null,null,null,null,null,null,null,null,null,null,null,null,null,null,"",null,null,null,null,null,null,null,null,null,null,null,null,null,null,null,null,null,"","","","",null,null,"","",null,null,null,null,null,null,null,null,null,null,null,null,null,null,null,null,null,null,null,null,null,null,null,null,null,null,null,null,0,0,0,0,null,null,null,null,0,0]
["EN TRATAMIENTO CON INSULINA",null,0,0,0,null,null,null,null,null,null,null,null,null,null,null,null,null,null,null,null,null,null,null,null,null,null,null,null,null,null,null,null,null,null,null,null,"",null,null,null,null,null,null,null,null,null,null,null,null,null,null,null,null,null,"","","","",null,null,"","",null,null,null,null,null,null,null,null,null,null,null,null,null,null,null,null,null,null,null,null,null,null,null,null,null,null,null,null,0,0,0,0,null,null,null,null,0,0]
["EN  TRATAMIENTO CON INSULINA QUE LOGRA META CON  HbA1C SEGÚN EDAD",null,0,0,0,null,null,null,null,null,null,null,null,null,null,null,null,null,null,null,null,null,null,null,null,null,null,null,null,null,null,null,null,null,null,null,null,"",null,null,null,null,null,null,null,null,null,null,null,null,null,null,null,null,null,"","","","",null,null,"","",null,null,null,null,null,null,null,null,null,null,null,null,null,null,null,null,null,null,null,null,null,null,null,null,null,null,null,null,0,0,0,0,null,null,null,null,0,0]
["CON HbA1C>= 9 %",null,0,0,0,null,null,null,null,null,null,null,null,null,null,null,null,null,null,null,null,null,null,null,null,null,null,null,null,null,null,null,null,null,null,null,null,"",null,null,null,null,null,null,null,null,null,null,null,null,null,null,null,null,null,"","","","",null,null,"","",null,null,null,null,null,null,null,null,null,null,null,null,null,null,null,null,null,null,null,null,null,null,null,null,null,null,null,null,0,0,0,0,null,null,null,null,0,0]
["FUMADOR ACTUAL",null,{"$f":"SUM(D57:E57)","v":0},{"$f":"+F57+H57+J57+L57+N57+P57+R57+T57+V57+X57+Z57+AB57+AD57+AF57","v":0},{"$f":"+G57+I57+K57+M57+O57+Q57+S57+U57+W57+Y57+AA57+AC57+AE57+AG57","v":0},null,null,null,null,null,null,null,null,null,null,null,null,null,null,null,null,null,null,null,null,null,null,null,null,null,null,null,null,null,null,null,null,"",null,null,null,null,null,null,null,null,null,null,null,null,null,null,null,null,null,"","","","",null,null,"","",null,null,null,null,null,null,null,null,null,null,null,null,null,null,null,null,null,null,null,null,null,null,null,null,null,null,null,null,0,0,0,0,null,null,null,null,0,0]
["CON ERC ETAPA 3B O SUPERIOR Y EN TRATAMIENTO CON IECA O ARA II",null,0,{"$f":"+F58+H58+J58+L58+N58+P58+R58+T58+V58+X58+Z58+AB58+AD58+AF58","v":0},{"$f":"+G58+I58+K58+M58+O58+Q58+S58+U58+W58+Y58+AA58+AC58+AE58+AG58","v":0},null,null,null,null,null,null,null,null,null,null,null,null,null,null,null,null,null,null,null,null,null,null,null,null,null,null,null,null,null,null,null,null,"",null,null,null,null,null,null,null,null,null,null,null,null,null,null,null,null,null,"","","","",null,null,"","",null,null,null,null,null,null,null,null,null,null,null,null,null,null,null,null,null,null,null,null,null,null,null,null,null,null,null,null,0,0,0,0,null,null,null,null,0,0]
["CON UN EXÁMEN DE COLESTEROL LDL VIGENTE",null,0,0,0,null,null,null,null,null,null,null,null,null,null,null,null,null,null,null,null,null,null,null,null,null,null,null,null,null,null,null,null,null,null,null,null,"",null,null,null,null,null,null,null,null,null,null,null,null,null,null,null,null,null,"","","","",null,null,"","",null,null,null,null,null,null,null,null,null,null,null,null,null,null,null,null,null,null,null,null,null,null,null,null,null,null,null,null,0,0,0,0,null,null,null,null,0,0]
["CON HIPOGLICEMIAS RECURRENTES",null,{"$f":"SUM(D60:E60)","v":0},{"$f":"+F60+H60+J60+L60+N60+P60+R60+T60+V60+X60+Z60+AB60+AD60+AF60","v":0},{"$f":"+G60+I60+K60+M60+O60+Q60+S60+U60+W60+Y60+AA60+AC60+AE60+AG60","v":0},null,null,null,null,null,null,null,null,null,null,null,null,null,null,null,null,null,null,null,null,null,null,null,null,null,null,null,null,null,null,null,null,"",null,null,null,null,null,null,null,null,null,null,null,null,null,null,null,null,null,"","","","",null,null,"","",null,null,null,null,null,null,null,null,null,null,null,null,null,null,null,null,null,null,null,null,null,null,null,null,null,null,null,null,0,0,0,0,null,null,null,null,0,0]
["CON *EVALUACIÓN VIGENTE DEL PIE SEGÚN PAUTA DE ESTIMACION DEL RIESGO DE ULCERACION EN PERSONAS CON DIABETES","Riesgo bajo",0,{"$f":"+F61+H61+J61+L61+N61+P61+R61+T61+V61+X61+Z61+AB61+AD61+AF61","v":0},{"$f":"+G61+I61+K61+M61+O61+Q61+S61+U61+W61+Y61+AA61+AC61+AE61+AG61","v":0},null,null,null,null,null,null,null,null,null,null,null,null,null,null,null,null,null,null,null,null,null,null,null,null,null,null,null,null,null,null,null,null,"",null,null,null,null,null,null,null,null,null,null,null,null,null,null,null,null,null,"","","","",null,null,"","",null,null,null,null,null,null,null,null,null,null,null,null,null,null,null,null,null,null,null,null,null,null,null,null,null,null,null,null,0,0,0,0,null,null,null,null,0,0]
[null,"Riesgo moderado ",0,0,0,null,null,null,null,null,null,null,null,null,null,null,null,null,null,null,null,null,null,null,null,null,null,null,null,null,null,null,null,null,null,null,null,"",null,null,null,null,null,null,null,null,null,null,null,null,null,null,null,null,null,"","","","",null,null,"","",null,null,null,null,null,null,null,null,null,null,null,null,null,null,null,null,null,null,null,null,null,null,null,null,null,null,null,null,0,0,0,0,null,null,null,null,0,0]
[null,"Riesgo alto",0,0,0,null,null,null,null,null,null,null,null,null,null,null,null,null,null,null,null,null,null,null,null,null,null,null,null,null,null,null,null,null,null,null,null,"",null,null,null,null,null,null,null,null,null,null,null,null,null,null,null,null,null,"","","","",null,null,"","",null,null,null,null,null,null,null,null,null,null,null,null,null,null,null,null,null,null,null,null,null,null,null,null,null,null,null,null,0,0,0,0,null,null,null,null,0,0]
[null,"Riesgo máximo ",0,0,0,null,null,null,null,null,null,null,null,null,null,null,null,null,null,null,null,null,null,null,null,null,null,null,null,null,null,null,null,null,null,null,null,"",null,null,null,null,null,null,null,null,null,null,null,null,null,null,null,null,null,"","","","",null,null,"","",null,null,null,null,null,null,null,null,null,null,null,null,null,null,null,null,null,null,null,null,null,null,null,null,null,null,null,null,0,0,0,0,null,null,null,null,0,0]
["CON ÚLCERAS ACTIVAS DE PIE DIABÉTICO TRATADAS CON CURACIÓN","Curación Convencional",0,{"$f":"+F65+H65+J65+L65+N65+P65+R65+T65+V65+X65+Z65+AB65+AD65+AF65","v":0},{"$f":"+G65+I65+K65+M65+O65+Q65+S65+U65+W65+Y65+AA65+AC65+AE65+AG65","v":0},null,null,null,null,null,null,null,null,null,null,null,null,null,null,null,null,null,null,null,null,null,null,null,null,null,null,null,null,null,null,null,null,"",null,null,null,null,null,null,null,null,null,null,null,null,null,null,null,null,null,"","","","",null,null,"","",null,null,null,null,null,null,null,null,null,null,null,null,null,null,null,null,null,null,null,null,null,null,null,null,null,null,null,null,0,0,0,0,null,null,null,null,0,0]
[null,"Curación Avanzada",{"$f":"SUM(D66:E66)","v":0},{"$f":"+F66+H66+J66+L66+N66+P66+R66+T66+V66+X66+Z66+AB66+AD66+AF66","v":0},{"$f":"+G66+I66+K66+M66+O66+Q66+S66+U66+W66+Y66+AA66+AC66+AE66+AG66","v":0},null,null,null,null,null,null,null,null,null,null,null,null,null,null,null,null,null,null,null,null,null,null,null,null,null,null,null,null,null,null,null,null,"",null,null,null,null,null,null,null,null,null,null,null,null,null,null,null,null,null,"","","","",null,null,"","",null,null,null,null,null,null,null,null,null,null,null,null,null,null,null,null,null,null,null,null,null,null,null,null,null,null,null,null,0,0,0,0,null,null,null,null,0,0]
[null,"Con ayuda técnica de descarga",{"$f":"SUM(D67:E67)","v":0},{"$f":"+F67+H67+J67+L67+N67+P67+R67+T67+V67+X67+Z67+AB67+AD67+AF67","v":0},0,null,null,null,null,null,null,null,null,null,null,null,null,null,null,null,null,null,null,null,null,null,null,null,null,null,null,null,null,null,null,null,null,"",null,null,null,null,null,null,null,null,null,null,null,null,null,null,null,null,null,"","","","",null,null,"","",null,null,null,null,null,null,null,null,null,null,null,null,null,null,null,null,null,null,null,null,null,null,null,null,null,null,null,null,0,0,0,0,null,null,null,null,0,0]
["CURACIÓN AVANZADA EN ULCERA VENOSA",null,0,0,0,null,null,null,null,null,null,null,null,null,null,null,null,null,null,null,null,null,null,null,null,null,null,null,null,null,null,null,null,null,null,null,null,{"$f":"BD68&BE68&BF68&BG68&BJ68&BK68","v":""},null,null,null,null,null,null,null,null,null,null,null,null,null,null,null,null,null,"","","","",null,null,"","",null,null,null,null,null,null,null,null,null,null,null,null,null,null,null,null,null,null,null,null,null,null,null,null,null,null,null,null,0,0,0,0,null,null,null,null,0,0]
["CON AMPUTACIÓN POR PIE DIABÉTICO",null,0,0,0,null,null,null,null,null,null,null,null,null,null,null,null,null,null,null,null,null,null,null,null,null,null,null,null,null,null,null,null,null,null,null,null,"",null,null,null,null,null,null,null,null,null,null,null,null,null,null,null,null,null,"","","","",null,null,"","",null,null,null,null,null,null,null,null,null,null,null,null,null,null,null,null,null,null,null,null,null,null,null,null,null,null,null,null,0,0,0,0,null,null,null,null,0,0]
["CON DIAGNÓSTICO ASOCIADO DE HIPERTENSIÓN ARTERIAL",null,0,0,0,null,null,null,null,null,null,null,null,null,null,null,null,null,null,null,null,null,null,null,null,null,null,null,null,null,null,null,null,null,null,null,null,"",null,null,null,null,null,null,null,null,null,null,null,null,null,null,null,null,null,"","","","",null,null,"","",null,null,null,null,null,null,null,null,null,null,null,null,null,null,null,null,null,null,null,null,null,null,null,null,null,null,null,null,0,0,0,0,null,null,null,null,0,0]
["CON DIAGNÓSTICO DE ENFERMEDAD RENAL CRÓNICA",null,{"$f":"SUM(D71:E71)","v":0},{"$f":"+F71+H71+J71+L71+N71+P71+R71+T71+V71+X71+Z71+AB71+AD71+AF71","v":0},{"$f":"+G71+I71+K71+M71+O71+Q71+S71+U71+W71+Y71+AA71+AC71+AE71+AG71","v":0},null,null,null,null,null,null,null,null,null,null,null,null,null,null,null,null,null,null,null,null,null,null,null,null,null,null,null,null,null,null,null,null,"",null,null,null,null,null,null,null,null,null,null,null,null,null,null,null,null,null,"","","","",null,null,"","",null,null,null,null,null,null,null,null,null,null,null,null,null,null,null,null,null,null,null,null,null,null,null,null,null,null,null,null,0,0,0,0,null,null,null,null,0,0]
["ANTECEDENTE DE ATAQUE CEREBRO VASCULAR",null,{"$f":"SUM(D72:E72)","v":0},0,0,null,null,null,null,null,null,null,null,null,null,null,null,null,null,null,null,null,null,null,null,null,null,null,null,null,null,null,null,null,null,null,null,"",null,null,null,null,null,null,null,null,null,null,null,null,null,null,null,null,null,"","","","",null,null,"","",null,null,null,null,null,null,null,null,null,null,null,null,null,null,null,null,null,null,null,null,null,null,null,null,null,null,null,null,0,0,0,0,null,null,null,null,0,0]
["ANTECEDENTES DE INFARTO AGUDO AL MIOCARDIO",null,0,0,0,null,null,null,null,null,null,null,null,null,null,null,null,null,null,null,null,null,null,null,null,null,null,null,null,null,null,null,null,null,null,null,null,"",null,null,null,null,null,null,null,null,null,null,null,null,null,null,null,null,null,"","","","",null,null,"","",null,null,null,null,null,null,null,null,null,null,null,null,null,null,null,null,null,null,null,null,null,null,null,null,null,null,null,null,0,0,0,0,null,null,null,null,0,0]
["RETINOPATÍA DIABETICA",null,{"$f":"SUM(D74:E74)","v":0},{"$f":"+F74+H74+J74+L74+N74+P74+R74+T74+V74+X74+Z74+AB74+AD74+AF74","v":0},{"$f":"+G74+I74+K74+M74+O74+Q74+S74+U74+W74+Y74+AA74+AC74+AE74+AG74","v":0},null,null,null,null,null,null,null,null,null,null,null,null,null,null,null,null,null,null,null,null,null,null,null,null,null,null,null,null,null,null,null,null,"",null,null,null,null,null,null,null,null,null,null,null,null,null,null,null,null,null,"","","","",null,null,"","",null,null,null,null,null,null,null,null,null,null,null,null,null,null,null,null,null,null,null,null,null,null,null,null,null,null,null,null,0,0,0,0,null,null,null,null,{"$f":"IF(AND(D74<>0,AH74=\"\"),1,IF(AND(E74<>0,AI74=\"\"),1,0))","v":0},{"$f":"IF(AND(D74<>0,AJ74=\"\"),1,IF(AND(E74<>0,AK74=\"\"),1,0))","v":0}]
["PERSONAS CON HIPERTENSION EN PSCV"]
["CON RAZON ALBÚMINA CREATININA (RAC),VIGENTE",null,{"$f":"SUM(D76:E76)","v":0},{"$f":"+F76+H76+J76+L76+N76+P76+R76+T76+V76+X76+Z76+AB76+AD76+AF76","v":0},{"$f":"+G76+I76+K76+M76+O76+Q76+S76+U76+W76+Y76+AA76+AC76+AE76+AG76","v":0},null,null,null,null,null,null,null,null,null,null,null,null,null,null,null,null,null,null,null,null,null,null,null,null,null,null,null,null,null,null,null,null,"",null,null,null,null,null,null,null,null,null,null,null,null,null,null,null,null,null,{"$f":"IF(D76>=AH76,\"\",\"* Pueblos Originarios Hombres no debe ser mayor al Total Hombres. \")","v":""},{"$f":"IF(E76>=AI76,\"\",\"* Pueblos Originarios Mujeres no debe ser mayor al Total Mujeres. \")","v":""},{"$f":"IF(D76>=AJ76,\"\",\"* Población Migrantes Hombres no debe ser mayor al Total Hombres. \")","v":""},{"$f":"IF(E76>=AK76,\"\",\"* Población Migrantes Mujeres no debe ser mayor al Total Mujeres. \")","v":""},null,null,{"$f":"IF(AND(D76<>0,AH76=\"\"),\"* No olvide escribir en la celda de 'Pueblos Originarios' (Digite CERO si no tiene). \",IF(AND(E76<>0,AI76=\"\"),\"* No olvide escribir en la celda de 'Pueblos Originarios' (Digite CERO si no tiene). \",\"\"))","v":""},{"$f":"IF(AND(D76<>0,AJ76=\"\"),\"* No olvide escribir en la celda de 'Población Migrantes' (Digite CERO si no tiene). \",IF(AND(E76<>0,AK76=\"\"),\"* No olvide escribir en la celda de 'Población Migrantes' (Digite CERO si no tiene). \",\"\"))","v":""},null,null,null,null,null,null,null,null,null,null,null,null,null,null,null,null,null,null,null,null,null,null,null,null,null,null,null,null,{"$f":"IF($D76>=$AH76,0,1)","v":0},{"$f":"IF($E76>=$AI76,0,1)","v":0},{"$f":"IF($D76>=$AJ76,0,1)","v":0},{"$f":"IF($E76>=$AK76,0,1)","v":0},null,null,null,null,{"$f":"IF(AND(D76<>0,AH76=\"\"),1,IF(AND(E76<>0,AI76=\"\"),1,0))","v":0},{"$f":"IF(AND(D76<>0,AJ76=\"\"),1,IF(AND(E76<>0,AK76=\"\"),1,0))","v":0}]
["CON VELOCIDAD DE FILTRACIÓN GLOMERULAR ESTIMADA (VFGe) Y CON RAZON ALBÚMINA CREATININA  (RAC) VIGENTE",null,{"$f":"SUM(D77:E77)","v":0},{"$f":"+F77+H77+J77+L77+N77+P77+R77+T77+V77+X77+Z77+AB77+AD77+AF77","v":0},{"$f":"+G77+I77+K77+M77+O77+Q77+S77+U77+W77+Y77+AA77+AC77+AE77+AG77","v":0},null,null,null,null,null,null,null,null,null,null,null,null,null,null,null,null,null,null,null,null,null,null,null,null,null,null,null,null,null,null,null,null,"",null,null,null,null,null,null,null,null,null,null,null,null,null,null,null,null,null,"","","","",null,null,{"$f":"IF(AND(D77<>0,AH77=\"\"),\"* No olvide escribir en la celda de 'Pueblos Originarios' (Digite CERO si no tiene). \",IF(AND(E77<>0,AI77=\"\"),\"* No olvide escribir en la celda de 'Pueblos Originarios' (Digite CERO si no tiene). \",\"\"))","v":""},{"$f":"IF(AND(D77<>0,AJ77=\"\"),\"* No olvide escribir en la celda de 'Población Migrantes' (Digite CERO si no tiene). \",IF(AND(E77<>0,AK77=\"\"),\"* No olvide escribir en la celda de 'Población Migrantes' (Digite CERO si no tiene). \",\"\"))","v":""},null,null,null,null,null,null,null,null,null,null,null,null,null,null,null,null,null,null,null,null,null,null,null,null,null,null,null,null,0,0,0,0,null,null,null,null,{"$f":"IF(AND(D77<>0,AH77=\"\"),1,IF(AND(E77<>0,AI77=\"\"),1,0))","v":0},{"$f":"IF(AND(D77<>0,AJ77=\"\"),1,IF(AND(E77<>0,AK77=\"\"),1,0))","v":0}]
["CON PRESIÓN ARTERIAL igual o Mayor 160/100 mmHg",null,0,0,0,null,null,null,null,null,null,null,null,null,null,null,null,null,null,null,null,null,null,null,null,null,null,null,null,null,null,null,null,null,null,null,null,"",null,null,null,null,null,null,null,null,null,null,null,null,null,null,null,null,null,"","","","",null,null,"","",null,null,null,null,null,null,null,null,null,null,null,null,null,null,null,null,null,null,null,null,null,null,null,null,null,null,null,null,0,0,0,0,null,null,null,null,0,0]
["CON VELOCIDAD DE FILTRACION GLOMERULAR  ESTIMADA  (VFGe) VIGENTE",null,0,0,0,null,null,null,null,null,null,null,null,null,null,null,null,null,null,null,null,null,null,null,null,null,null,null,null,null,null,null,null,null,null,null,null,"",null,null,null,null,null,null,null,null,null,null,null,null,null,null,null,null,null,"","","","",null,null,"","",null,null,null,null,null,null,null,null,null,null,null,null,null,null,null,null,null,null,null,null,null,null,null,null,null,null,null,null,0,0,0,0,null,null,null,null,0,0]
["PROTOCOLO HEARTS",null,{"$f":"SUM(D80:E80)","v":0},{"$f":"+F80+H80+J80+L80+N80+P80+R80+T80+V80+X80+Z80+AB80+AD80+AF80","v":0},{"$f":"+G80+I80+K80+M80+O80+Q80+S80+U80+W80+Y80+AA80+AC80+AE80+AG80","v":0},null,null,null,null,null,null,null,null,null,null,null,null,null,null,null,null,null,null,null,null,null,null,null,null,null,null,null,null,null,null,null,null,"",null,null,null,null,null,null,null,null,null,null,null,null,null,null,null,null,null,"","","","",null,null,"","",null,null,null,null,null,null,null,null,null,null,null,null,null,null,null,null,null,null,null,null,null,null,null,null,null,null,null,null,0,0,0,0,null,null,null,null,{"$f":"IF(AND(D80<>0,AH80=\"\"),1,IF(AND(E80<>0,AI80=\"\"),1,0))","v":0},0]
["TODAS LAS PERSONAS EN PSCV"]
["SOBREPESO: IMC entre 25 y 29.9 <65",null,{"$f":"SUM(D82:E82)","v":0},{"$f":"+F82+H82+J82+L82+N82+P82+R82+T82+V82+X82","v":0},{"$f":"+G82+I82+K82+M82+O82+Q82+S82+U82+W82+Y82","v":0},null,null,null,null,null,null,null,null,null,null,null,null,null,null,null,null,null,null,null,null,null,null,null,null,null,null,null,null,null,null,null,null,"",null,null,null,null,null,null,null,null,null,null,null,null,null,null,null,null,null,{"$f":"IF(D82>=AH82,\"\",\"* Pueblos Originarios Hombres no debe ser mayor al Total Hombres. \")","v":""},{"$f":"IF(E82>=AI82,\"\",\"* Pueblos Originarios Mujeres no debe ser mayor al Total Mujeres. \")","v":""},{"$f":"IF(D82>=AJ82,\"\",\"* Población Migrantes Hombres no debe ser mayor al Total Hombres. \")","v":""},{"$f":"IF(E82>=AK82,\"\",\"* Población Migrantes Mujeres no debe ser mayor al Total Mujeres. \")","v":""},null,null,{"$f":"IF(AND(D82<>0,AH82=\"\"),\"* No olvide escribir en la celda de 'Pueblos Originarios' (Digite CERO si no tiene). \",IF(AND(E82<>0,AI82=\"\"),\"* No olvide escribir en la celda de 'Pueblos Originarios' (Digite CERO si no tiene). \",\"\"))","v":""},{"$f":"IF(AND(D82<>0,AJ82=\"\"),\"* No olvide escribir en la celda de 'Población Migrantes' (Digite CERO si no tiene). \",IF(AND(E82<>0,AK82=\"\"),\"* No olvide escribir en la celda de 'Población Migrantes' (Digite CERO si no tiene). \",\"\"))","v":""},null,null,null,null,null,null,null,null,null,null,null,null,null,null,null,null,null,null,null,null,null,null,null,null,null,null,null,null,0,0,0,0,null,null,null,null,{"$f":"IF(AND(D82<>0,AH82=\"\"),1,IF(AND(E82<>0,AI82=\"\"),1,0))","v":0},{"$f":"IF(AND(D82<>0,AJ82=\"\"),1,IF(AND(E82<>0,AK82=\"\"),1,0))","v":0}]
["SOBREPESO: IMC entre 28 y 31.9 >65",null,0,{"$f":"+Z83+AB83+AD83+AF83","v":0},{"$f":"+AA83+AC83+AE83+AG83","v":0},null,null,null,null,null,null,null,null,null,null,null,null,null,null,null,null,null,null,null,null,null,null,null,null,null,null,null,null,null,null,null,null,"",null,null,null,null,null,null,null,null,null,null,null,null,null,null,null,null,null,"","","","",null,null,{"$f":"IF(AND(D83<>0,AH83=\"\"),\"* No olvide escribir en la celda de 'Pueblos Originarios' (Digite CERO si no tiene). \",IF(AND(E83<>0,AI83=\"\"),\"* No olvide escribir en la celda de 'Pueblos Originarios' (Digite CERO si no tiene). \",\"\"))","v":""},{"$f":"IF(AND(D83<>0,AJ83=\"\"),\"* No olvide escribir en la celda de 'Población Migrantes' (Digite CERO si no tiene). \",IF(AND(E83<>0,AK83=\"\"),\"* No olvide escribir en la celda de 'Población Migrantes' (Digite CERO si no tiene). \",\"\"))","v":""},null,null,null,null,null,null,null,null,null,null,null,null,null,null,null,null,null,null,null,null,null,null,null,null,null,null,null,null,0,0,0,0,null,null,null,null,{"$f":"IF(AND(D83<>0,AH83=\"\"),1,IF(AND(E83<>0,AI83=\"\"),1,0))","v":0},{"$f":"IF(AND(D83<>0,AJ83=\"\"),1,IF(AND(E83<>0,AK83=\"\"),1,0))","v":0}]
["OBESIDAD: IMC igual o Mayor a 30KG/M2 <65",null,0,{"$f":"+F84+H84+J84+L84+N84+P84+R84+T84+V84+X84","v":0},{"$f":"+G84+I84+K84+M84+O84+Q84+S84+U84+W84+Y84","v":0},null,null,null,null,null,null,null,null,null,null,null,null,null,null,null,null,null,null,null,null,null,null,null,null,null,null,null,null,null,null,null,null,"",null,null,null,null,null,null,null,null,null,null,null,null,null,null,null,null,null,"","","","",null,null,"","",null,null,null,null,null,null,null,null,null,null,null,null,null,null,null,null,null,null,null,null,null,null,null,null,null,null,null,null,0,0,0,0,null,null,null,null,0,0]
["OBESIDAD: IMC igual o Mayor a 32KG/M2 >65",null,0,{"$f":"+Z85+AB85+AD85+AF85","v":0},{"$f":"+AA85+AC85+AE85+AG85","v":0},null,null,null,null,null,null,null,null,null,null,null,null,null,null,null,null,null,null,null,null,null,null,null,null,null,null,null,null,null,null,null,null,"",null,null,null,null,null,null,null,null,null,null,null,null,null,null,null,null,null,"","","","",null,null,"","",null,null,null,null,null,null,null,null,null,null,null,null,null,null,null,null,null,null,null,null,null,null,null,null,null,null,null,null,0,0,0,0,null,null,null,null,0,0]
["PERSONAS EN ACTIVIDAD FÍSICA SALUD CARDIOVASCULAR",null,0,{"$f":"+F86+H86+J86+L86+N86+P86+R86+T86+V86+X86+Z86+AB86+AD86+AF86","v":0},{"$f":"+G86+I86+K86+M86+O86+Q86+S86+U86+W86+Y86+AA86+AC86+AE86+AG86","v":0},null,null,null,null,null,null,null,null,null,null,null,null,null,null,null,null,null,null,null,null,null,null,null,null,null,null,null,null,null,null,null,null,"",null,null,null,null,null,null,null,null,null,null,null,null,null,null,null,null,null,"","","","",null,null,{"$f":"IF(AND(D86<>0,AH86=\"\"),\"* No olvide escribir en la celda de 'Pueblos Originarios' (Digite CERO si no tiene). \",IF(AND(E86<>0,AI86=\"\"),\"* No olvide escribir en la celda de 'Pueblos Originarios' (Digite CERO si no tiene). \",\"\"))","v":""},{"$f":"IF(AND(D86<>0,AJ86=\"\"),\"* No olvide escribir en la celda de 'Población Migrantes' (Digite CERO si no tiene). \",IF(AND(E86<>0,AK86=\"\"),\"* No olvide escribir en la celda de 'Población Migrantes' (Digite CERO si no tiene). \",\"\"))","v":""},null,null,null,null,null,null,null,null,null,null,null,null,null,null,null,null,null,null,null,null,null,null,null,null,null,null,null,null,0,0,0,0,null,null,null,null,0,0]
["NOTA (*): La vigencia de la evaluación del pie diabético es de 12 meses."]
[]
[]
[]
[]
[]
[]
[]
[]
[]
[]
[]
[]
[{"$f":"SUM(C12:C28,C34:C42,C48:C74,C76:C80,C82:C86)","v":0},"datos"]
[{"$f":"SUM(CL13:DS86)","v":0},"errores"]

{"sheet":"P5","index":5,"n_rows":82,"n_cols":101,"rows_kept":82,"cut":false,"hidden":false,"merged":[[30,91,31,92],[30,97,31,98],[30,99,31,99],[30,80,31,81],[30,82,31,83],[30,84,31,84],[30,85,31,85],[30,93,31,94],[30,95,31,95],[30,96,31,96],[9,5,9,6],[9,7,9,8],[9,9,9,10],[9,19,9,20],[8,25,9,26],[49,25,50,26],[49,21,50,22],[49,23,50,24],[40,15,40,16],[40,17,40,18],[40,19,40,20],[39,21,40,22],[39,23,40,24],[44,21,45,22],[44,23,45,24],[39,25,40,26],[44,25,45,26],[22,23,23,24],[8,21,9,22],[8,23,9,24],[6,4,6,17],[49,0,51,0],[45,5,45,6],[50,5,50,6],[50,9,50,10],[45,9,45,10],[45,11,45,12],[50,7,50,8],[40,11,40,12],[44,2,45,4],[39,0,41,1],[40,7,40,8],[8,2,9,4],[40,13,40,14],[9,13,9,14],[9,11,9,12],[9,15,9,16],[9,17,9,18],[23,15,23,16],[39,2,40,4],[38,0,38,6],[47,0,47,1],[40,5,40,6],[42,0,42,1],[44,0,46,1],[55,0,56,0],[49,2,50,4],[52,0,54,0],[48,0,48,8],[43,0,43,7],[45,7,45,8],[39,5,39,20],[50,15,50,16],[50,17,50,18],[50,19,50,20],[50,11,50,12],[49,5,49,20],[49,1,51,1],[50,13,50,14],[45,13,45,14],[45,15,45,16],[45,17,45,18],[45,19,45,20],[44,5,44,20],[40,9,40,10],[36,0,36,1],[37,0,37,1],[30,23,31,24],[30,21,31,22],[31,13,31,14],[23,5,23,6],[31,19,31,20],[31,7,31,8],[30,2,31,4],[30,0,32,1],[22,2,23,4],[31,9,31,10],[31,11,31,12],[31,15,31,16],[31,17,31,18],[30,5,30,20],[31,5,31,6],[33,0,33,1],[22,0,24,1],[25,0,25,1],[26,0,26,1],[27,0,27,1],[28,0,28,1],[23,17,23,18],[7,86,7,87],[19,0,19,1],[20,0,20,1],[34,0,34,1],[35,0,35,1],[8,0,10,1],[11,0,11,1],[12,0,12,1],[13,0,13,1],[14,0,14,1],[15,0,15,1],[16,0,16,1],[17,0,17,1],[18,0,18,1],[23,19,23,20],[23,21,23,22],[30,25,31,26],[22,5,22,22],[8,5,8,20],[22,25,23,26],[23,7,23,8],[23,9,23,10],[23,11,23,12],[23,13,23,14]]}
["DATOS DEL ESTABLECIMIENTO"]
[{"$f":"CONCATENATE(\"COMUNA: \",NOMBRE!$B$2,\" - \",\"( \",NOMBRE!$C$2,NOMBRE!$D$2,NOMBRE!$E$2,NOMBRE!$F$2,NOMBRE!$G$2,\" )\")","v":"COMUNA:  - (  )"}]
[{"$f":"CONCATENATE(\"ESTABLECIMIENTO/ESTRATEGIA: \",NOMBRE!$B$3,\" - \",\"( \",NOMBRE!$C$3,NOMBRE!$D$3,NOMBRE!$E$3,NOMBRE!$F$3,NOMBRE!$G$3,NOMBRE!$H$3,\" )\")","v":"ESTABLECIMIENTO/ESTRATEGIA:  - (  )"}]
[{"$f":"CONCATENATE(\"MES: \",NOMBRE!$B$6,\" - \",\"( \",NOMBRE!$C$6,NOMBRE!$D$6,\" )\")","v":"MES:  - (  )"}]
[{"$f":"CONCATENATE(\"AÑO: \",NOMBRE!$B$7)","v":"AÑO: 2024"}]
[]
[null,null,null,null,"REM-P5. POBLACIÓN EN CONTROL PROGRAMA NACIONAL DE SALUD INTEGRAL DE PERSONAS MAYORES "]
["SECCION A: POBLACIÓN EN CONTROL POR CONDICIÓN DE FUNCIONALIDAD",null,null,null,null,null,null,null,null,null,null,null,null,null,null,null,null,null,null,null,null,null,null,null,null,null,null,null,null,null,null,null,null,null,null,null,null,null,null,null,null,null,null,null,null,null,null,null,null,null,null,null,null,null,null,null,null,null,null,null,null,null,null,null,null,null,null,null,null,null,null,null,null,null,null,null,null,null,null,null,"Pueblos Originarios",null,"Población Migrantes",null,"Pueblos Originarios","Población Migrantes","Personas Mayores en ELEAM",null,"Personas Mayores en ELEAM",null,null,"Pueblos Originarios",null,"Población Migrantes",null,"Pueblos Originarios","Población Migrantes"]
["CONDICIÓN DE \nFUNCIONALIDAD",null,"TOTAL",null,null,"GRUPO DE EDAD (en años) Y SEXO",null,null,null,null,null,null,null,null,null,null,null,null,null,null,null,"Pueblos Originarios",null," Migrantes",null,"Personas Mayores en ELEAM"]
[null,null,null,null,null,"65 a 69 años",null,"70 a 74 años",null,"75 a 79 años",null,"80 a 84 años",null,"85 a 89 años",null,"90 a 94 años",null,"95 a 99 años",null,"100 y mas años",null,null,null,null,null,null,null,null,null,null,null,null,null,null,null,null,null,null,null,null,null,null,null,null,null,null,null,null,null,null,null,null,null,null,null,null,null,null,null,null,null,null,null,null,null,null,null,null,null,null,null,null,null,null,null,null,null,null,null,null,"Hombres","Mujeres","Hombres","Mujeres","No Olvide","No Olvide","Hombres","Mujeres","No Olvide",null,null,"Hombres","Mujeres","Hombres","Mujeres","No Olvide","No Olvide"]
[null,null,"Ambos\nsexos","Hombres","Mujeres","Hombres ","Mujeres","Hombres ","Mujeres","Hombres ","Mujeres","Hombres ","Mujeres","Hombres ","Mujeres","Hombres ","Mujeres","Hombres ","Mujeres","Hombres ","Mujeres","Hombres","Mujeres","Hombres","Mujeres","Hombres","Mujeres"]
["AUTOVALENTE SIN RIESGO",null,{"$f":"SUM(D12:E12)","v":0},{"$f":"+F12+H12+J12+L12+N12+P12+R12+T12","v":0},{"$f":"+G12+I12+K12+M12+O12+Q12+S12+U12","v":0},null,null,null,null,null,null,null,null,null,null,null,null,null,null,null,null,null,0,null,0,null,0,{"$f":"CC12&CD12&CE12&CF12&CG12&CH12&CI12&CJ12&CK12","v":""},null,null,null,null,null,null,null,null,null,null,null,null,null,null,null,null,null,null,null,null,null,null,null,null,null,null,null,null,null,null,null,null,null,null,null,null,null,null,null,null,null,null,null,null,null,null,null,null,null,null,null,null,{"$f":"IF(D12>=V12,\"\",\"* La celda Pueblos Originarios Hombres debe ser menor o igual al Total Hombres. \")","v":""},{"$f":"IF(E12>=W12,\"\",\"* La celda Pueblos Originarios Mujeres debe ser menor o igual al Total Mujeres. \")","v":""},{"$f":"IF(D12>=X12,\"\",\"* La celda Población Migrantes Hombres debe ser menor o igual al Total Hombres. \")","v":""},{"$f":"IF(E12>=Y12,\"\",\"* La celda Población Migrantes Mujeres debe ser menor o igual al Total Mujeres. \")","v":""},{"$f":"IF(AND(D12<>0,V12=\"\"),\"* No olvide escribir en las celdas de Pueblos Originarios Hombres. (Digite CERO si no tiene). \",IF(AND(E12<>0,W12=\"\"),\"* No olvide escribir en las celdas de Pueblos Originarios Mujeres. (Digite CERO si no tiene). \",\"\"))","v":""},{"$f":"IF(AND(D12<>0,X12=\"\"),\"* No olvide escribir en las celdas de Población Migrantes Hombres. (Digite CERO si no tiene). \",IF(AND(E12<>0,Y12=\"\"),\"* No olvide escribir en las celdas de Población Migrantes Mujeres. (Digite CERO si no tiene). \",\"\"))","v":""},{"$f":"IF(D12>=Z12,\"\",\"* La celda Personas Mayores en ELEAM Hombres debe ser menor o igual al Total Hombres. \")","v":""},{"$f":"IF(E12>=AA12,\"\",\"* La celda Personas Mayores en ELEAM Mujeres debe ser menor o igual al Total Mujeres. \")","v":""},{"$f":"IF(AND(D12<>0,Z12=\"\"),\"* No olvide escribir en las celdas de Personas Mayores en ELEAM Hombres. (Digite CERO si no tiene). \",IF(AND(E12<>0,AA12=\"\"),\"* No olvide escribir en las celdas de Personas Mayores en ELEAM Mujeres. (Digite CERO si no tiene). \",\"\"))","v":""},null,null,{"$f":"IF($D12>=$V12,0,1)","v":0},{"$f":"IF($E12>=$W12,0,1)","v":0},{"$f":"IF($D12>=$X12,0,1)","v":0},{"$f":"IF($E12>=$Y12,0,1)","v":0},{"$f":"IF(AND(D12<>0,V12=\"\"),1,IF(AND(E12<>0,W12=\"\"),1,0))","v":0},{"$f":"IF(AND(D12<>0,X12=\"\"),1,IF(AND(E12<>0,Y12=\"\"),1,0))","v":0},{"$f":"IF($D12>=$Z12,0,1)","v":0},{"$f":"IF($E12>=$AA12,0,1)","v":0},{"$f":"IF(AND(D12<>0,Z12=\"\"),1,IF(AND(E12<>0,AA12=\"\"),1,0))","v":0}]
["AUTOVALENTE CON RIESGO",null,0,{"$f":"+F13+H13+J13+L13+N13+P13+R13+T13","v":0},{"$f":"+G13+I13+K13+M13+O13+Q13+S13+U13","v":0},null,null,null,null,null,null,null,null,null,null,null,null,null,null,null,null,null,null,null,null,null,null,{"$f":"CC13&CD13&CE13&CF13&CG13&CH13&CI13&CJ13&CK13","v":""},null,null,null,null,null,null,null,null,null,null,null,null,null,null,null,null,null,null,null,null,null,null,null,null,null,null,null,null,null,null,null,null,null,null,null,null,null,null,null,null,null,null,null,null,null,null,null,null,null,null,null,null,{"$f":"IF(D13>=V13,\"\",\"* La celda Pueblos Originarios Hombres debe ser menor o igual al Total Hombres. \")","v":""},{"$f":"IF(E13>=W13,\"\",\"* La celda Pueblos Originarios Mujeres debe ser menor o igual al Total Mujeres. \")","v":""},{"$f":"IF(D13>=X13,\"\",\"* La celda Población Migrantes Hombres debe ser menor o igual al Total Hombres. \")","v":""},{"$f":"IF(E13>=Y13,\"\",\"* La celda Población Migrantes Mujeres debe ser menor o igual al Total Mujeres. \")","v":""},{"$f":"IF(AND(D13<>0,V13=\"\"),\"* No olvide escribir en las celdas de Pueblos Originarios Hombres. (Digite CERO si no tiene). \",IF(AND(E13<>0,W13=\"\"),\"* No olvide escribir en las celdas de Pueblos Originarios Mujeres. (Digite CERO si no tiene). \",\"\"))","v":""},{"$f":"IF(AND(D13<>0,X13=\"\"),\"* No olvide escribir en las celdas de Población Migrantes Hombres. (Digite CERO si no tiene). \",IF(AND(E13<>0,Y13=\"\"),\"* No olvide escribir en las celdas de Población Migrantes Mujeres. (Digite CERO si no tiene). \",\"\"))","v":""},{"$f":"IF(D13>=Z13,\"\",\"* La celda Personas Mayores en ELEAM Hombres debe ser menor o igual al Total Hombres. \")","v":""},{"$f":"IF(E13>=AA13,\"\",\"* La celda Personas Mayores en ELEAM Mujeres debe ser menor o igual al Total Mujeres. \")","v":""},{"$f":"IF(AND(D13<>0,Z13=\"\"),\"* No olvide escribir en las celdas de Personas Mayores en ELEAM Hombres. (Digite CERO si no tiene). \",IF(AND(E13<>0,AA13=\"\"),\"* No olvide escribir en las celdas de Personas Mayores en ELEAM Mujeres. (Digite CERO si no tiene). \",\"\"))","v":""},null,null,{"$f":"IF($D13>=$V13,0,1)","v":0},{"$f":"IF($E13>=$W13,0,1)","v":0},{"$f":"IF($D13>=$X13,0,1)","v":0},{"$f":"IF($E13>=$Y13,0,1)","v":0},{"$f":"IF(AND(D13<>0,V13=\"\"),1,IF(AND(E13<>0,W13=\"\"),1,0))","v":0},{"$f":"IF(AND(D13<>0,X13=\"\"),1,IF(AND(E13<>0,Y13=\"\"),1,0))","v":0},{"$f":"IF($D13>=$Z13,0,1)","v":0},{"$f":"IF($E13>=$AA13,0,1)","v":0},{"$f":"IF(AND(D13<>0,Z13=\"\"),1,IF(AND(E13<>0,AA13=\"\"),1,0))","v":0}]
["RIESGO DE DEPENDENCIA ",null,0,0,0,null,null,null,null,null,null,null,null,null,null,null,null,null,null,null,null,null,null,null,null,null,null,"",null,null,null,null,null,null,null,null,null,null,null,null,null,null,null,null,null,null,null,null,null,null,null,null,null,null,null,null,null,null,null,null,null,null,null,null,null,null,null,null,null,null,null,null,null,null,null,null,null,null,null,null,"","","","","","","","","",null,null,{"$f":"IF($D14>=$V14,0,1)","v":0},{"$f":"IF($E14>=$W14,0,1)","v":0},{"$f":"IF($D14>=$X14,0,1)","v":0},{"$f":"IF($E14>=$Y14,0,1)","v":0},{"$f":"IF(AND(D14<>0,V14=\"\"),1,IF(AND(E14<>0,W14=\"\"),1,0))","v":0},{"$f":"IF(AND(D14<>0,X14=\"\"),1,IF(AND(E14<>0,Y14=\"\"),1,0))","v":0},0,0,0]
["SUBTOTAL (EFAM)",null,{"$f":"SUM(D15:E15)","v":0},{"$f":"+F15+H15+J15+L15+N15+P15+R15+T15","v":0},{"$f":"+G15+I15+K15+M15+O15+Q15+S15+U15","v":0},{"$f":"SUM(F12:F14)","v":0},{"$f":"SUM(G12:G14)","v":0},0,0,0,0,0,0,{"$f":"SUM(N12:N14)","v":0},0,{"$f":"SUM(P12:P14)","v":0},0,{"$f":"SUM(R12:R14)","v":0},0,0,0,{"$f":"SUM(V12:V14)","v":0},{"$f":"SUM(W12:W14)","v":0},0,{"$f":"SUM(Y12:Y14)","v":0},{"$f":"SUM(Z12:Z14)","v":0},{"$f":"SUM(AA12:AA14)","v":0},null,null,null,null,null,null,null,null,null,null,null,null,null,null,null,null,null,null,null,null,null,null,null,null,null,null,null,null,null,null,null,null,null,null,null,null,null,null,null,null,null,null,null,null,null,null,null,null,null,null,null,null,null,""]
["DEPENDIENTE LEVE",null,0,{"$f":"+F16+H16+J16+L16+N16+P16+R16+T16","v":0},{"$f":"+G16+I16+K16+M16+O16+Q16+S16+U16","v":0},null,null,null,null,null,null,null,null,null,null,null,null,null,null,null,null,null,null,null,null,null,null,"",null,null,null,null,null,null,null,null,null,null,null,null,null,null,null,null,null,null,null,null,null,null,null,null,null,null,null,null,null,null,null,null,null,null,null,null,null,null,null,null,null,null,null,null,null,null,null,null,null,null,null,null,"",{"$f":"IF(E16>=W16,\"\",\"* La celda Pueblos Originarios Mujeres debe ser menor o igual al Total Mujeres. \")","v":""},{"$f":"IF(D16>=X16,\"\",\"* La celda Población Migrantes Hombres debe ser menor o igual al Total Hombres. \")","v":""},{"$f":"IF(E16>=Y16,\"\",\"* La celda Población Migrantes Mujeres debe ser menor o igual al Total Mujeres. \")","v":""},{"$f":"IF(AND(D16<>0,V16=\"\"),\"* No olvide escribir en las celdas de Pueblos Originarios Hombres. (Digite CERO si no tiene). \",IF(AND(E16<>0,W16=\"\"),\"* No olvide escribir en las celdas de Pueblos Originarios Mujeres. (Digite CERO si no tiene). \",\"\"))","v":""},{"$f":"IF(AND(D16<>0,X16=\"\"),\"* No olvide escribir en las celdas de Población Migrantes Hombres. (Digite CERO si no tiene). \",IF(AND(E16<>0,Y16=\"\"),\"* No olvide escribir en las celdas de Población Migrantes Mujeres. (Digite CERO si no tiene). \",\"\"))","v":""},"","","",null,null,{"$f":"IF($D16>=$V16,0,1)","v":0},{"$f":"IF($E16>=$W16,0,1)","v":0},{"$f":"IF($D16>=$X16,0,1)","v":0},{"$f":"IF($E16>=$Y16,0,1)","v":0},{"$f":"IF(AND(D16<>0,V16=\"\"),1,IF(AND(E16<>0,W16=\"\"),1,0))","v":0},{"$f":"IF(AND(D16<>0,X16=\"\"),1,IF(AND(E16<>0,Y16=\"\"),1,0))","v":0},{"$f":"IF($D16>=$Z16,0,1)","v":0},{"$f":"IF($E16>=$AA16,0,1)","v":0},{"$f":"IF(AND(D16<>0,Z16=\"\"),1,IF(AND(E16<>0,AA16=\"\"),1,0))","v":0}]
["DEPENDIENTE MODERADO ",null,0,{"$f":"+F17+H17+J17+L17+N17+P17+R17+T17","v":0},0,null,null,null,null,null,null,null,null,null,null,null,null,null,null,null,null,null,null,null,null,null,null,"",null,null,null,null,null,null,null,null,null,null,null,null,null,null,null,null,null,null,null,null,null,null,null,null,null,null,null,null,null,null,null,null,null,null,null,null,null,null,null,null,null,null,null,null,null,null,null,null,null,null,null,null,"","","","","","","","","",null,null,{"$f":"IF($D17>=$V17,0,1)","v":0},{"$f":"IF($E17>=$W17,0,1)","v":0},{"$f":"IF($D17>=$X17,0,1)","v":0},{"$f":"IF($E17>=$Y17,0,1)","v":0},{"$f":"IF(AND(D17<>0,V17=\"\"),1,IF(AND(E17<>0,W17=\"\"),1,0))","v":0},{"$f":"IF(AND(D17<>0,X17=\"\"),1,IF(AND(E17<>0,Y17=\"\"),1,0))","v":0},0,0,0]
["DEPENDIENTE GRAVE ",null,0,0,0,null,null,null,null,null,null,null,null,null,null,null,null,null,null,null,null,null,null,null,null,null,null,"",null,null,null,null,null,null,null,null,null,null,null,null,null,null,null,null,null,null,null,null,null,null,null,null,null,null,null,null,null,null,null,null,null,null,null,null,null,null,null,null,null,null,null,null,null,null,null,null,null,null,null,null,"","","","","","","","","",null,null,{"$f":"IF($D18>=$V18,0,1)","v":0},{"$f":"IF($E18>=$W18,0,1)","v":0},{"$f":"IF($D18>=$X18,0,1)","v":0},{"$f":"IF($E18>=$Y18,0,1)","v":0},{"$f":"IF(AND(D18<>0,V18=\"\"),1,IF(AND(E18<>0,W18=\"\"),1,0))","v":0},{"$f":"IF(AND(D18<>0,X18=\"\"),1,IF(AND(E18<>0,Y18=\"\"),1,0))","v":0},0,0,0]
["DEPENDIENTE TOTAL",null,0,{"$f":"+F19+H19+J19+L19+N19+P19+R19+T19","v":0},0,null,null,null,null,null,null,null,null,null,null,null,null,null,null,null,null,null,null,null,null,null,null,"",null,null,null,null,null,null,null,null,null,null,null,null,null,null,null,null,null,null,null,null,null,null,null,null,null,null,null,null,null,null,null,null,null,null,null,null,null,null,null,null,null,null,null,null,null,null,null,null,null,null,null,null,"","","","","","","","","",null,null,{"$f":"IF($D19>=$V19,0,1)","v":0},{"$f":"IF($E19>=$W19,0,1)","v":0},{"$f":"IF($D19>=$X19,0,1)","v":0},{"$f":"IF($E19>=$Y19,0,1)","v":0},{"$f":"IF(AND(D19<>0,V19=\"\"),1,IF(AND(E19<>0,W19=\"\"),1,0))","v":0},{"$f":"IF(AND(D19<>0,X19=\"\"),1,IF(AND(E19<>0,Y19=\"\"),1,0))","v":0},0,0,0]
["SUBTOTAL (INDICE BARTHEL)",null,{"$f":"SUM(D20:E20)","v":0},{"$f":"+F20+H20+J20+L20+N20+P20+R20+T20","v":0},{"$f":"+G20+I20+K20+M20+O20+Q20+S20+U20","v":0},{"$f":"SUM(F16:F19)","v":0},{"$f":"SUM(G16:G19)","v":0},0,0,0,0,0,0,{"$f":"SUM(N16:N19)","v":0},0,{"$f":"SUM(P16:P19)","v":0},0,{"$f":"SUM(R16:R19)","v":0},0,0,0,{"$f":"SUM(V16:V19)","v":0},{"$f":"SUM(W16:W19)","v":0},0,{"$f":"SUM(Y16:Y19)","v":0},{"$f":"SUM(Z16:Z19)","v":0},{"$f":"SUM(AA16:AA19)","v":0}]
["TOTAL PERSONAS MAYORES EN CONTROL",null,0,{"$f":"+F21+H21+J21+L21+N21+P21+R21+T21","v":0},{"$f":"+G21+I21+K21+M21+O21+Q21+S21+U21","v":0},{"$f":"+F15+F20","v":0},{"$f":"+G15+G20","v":0},0,0,0,0,0,0,{"$f":"+N15+N20","v":0},0,{"$f":"+P15+P20","v":0},0,{"$f":"+R15+R20","v":0},0,0,0,{"$f":"+V15+V20","v":0},{"$f":"+W15+W20","v":0},0,{"$f":"+Y15+Y20","v":0},{"$f":"+Z15+Z20","v":0},{"$f":"+AA15+AA20","v":0}]
["SECCION A.1: EXISTENCIA DE POBLACIÓN EN CONTROL EN PROGRAMA \"MÁS ADULTOS MAYORES AUTOVALENTES\" POR CONDICIÓN DE FUNCIONALIDAD"]
["CONDICIÓN DE \nFUNCIONALIDAD",null,"TOTAL",null,null,"GRUPO DE EDAD (en años) Y SEXO",null,null,null,null,null,null,null,null,null,null,null,null,null,null,null,null,null,"Pueblos Originarios",null," Migrantes",null,null,null,null,null,null,null,null,null,null,null,null,null,null,null,null,null,null,null,null,null,null,null,null,null,null,null,null,null,null,null,null,null,null,null,null,null,null,null,null,null,null,null,null,null,null,null,null,null,null,null,null,null,null,"Pueblos Originarios",null,"Población Migrantes",null,"Pueblos Originarios","Población Migrantes",null,null,null,null,null,"Pueblos Originarios",null,"Población Migrantes",null,"Pueblos Originarios","Población Migrantes"]
[null,null,null,null,null,"60 a 64 años",null,"65 a 69 años",null,"70 a 74 años",null,"75 a 79 años",null,"80 a 84 años",null,"85 a 89 años",null,"90 a 94 años",null,"95 a 99 años",null,"100 y mas años"]
[null,null,"Ambos\nsexos","Hombres","Mujeres","Hombres ","Mujeres","Hombres ","Mujeres","Hombres ","Mujeres","Hombres ","Mujeres","Hombres ","Mujeres","Hombres ","Mujeres","Hombres ","Mujeres","Hombres ","Mujeres","Hombres ","Mujeres","Hombres","Mujeres","Hombres","Mujeres",null,null,null,null,null,null,null,null,null,null,null,null,null,null,null,null,null,null,null,null,null,null,null,null,null,null,null,null,null,null,null,null,null,null,null,null,null,null,null,null,null,null,null,null,null,null,null,null,null,null,null,null,null,"Hombres","Mujeres","Hombres","Mujeres","No Olvide","No Olvide",null,null,null,null,null,"Hombres","Mujeres","Hombres","Mujeres","No Olvide","No Olvide"]
["AUTOVALENTE SIN RIESGO",null,{"$f":"SUM(D26:E26)","v":0},{"$f":"+F26+H26+J26+L26+N26+P26+R26+T26+V26","v":0},{"$f":"+G26+I26+K26+M26+O26+Q26+S26+U26+W26","v":0},null,null,null,null,null,null,null,null,null,null,null,null,null,null,null,null,null,null,null,null,null,null,{"$f":"CA26&CB26&CC26&CD26&CE26&CF26&CG26&CH26&CM26","v":""},null,null,null,null,null,null,null,null,null,null,null,null,null,null,null,null,null,null,null,null,null,null,null,null,null,null,null,null,null,null,null,null,null,null,null,null,null,null,null,null,null,null,null,null,null,null,null,null,null,null,null,null,{"$f":"IF(D26>=X26,\"\",\"* La celda Pueblos Originarios Hombres debe ser menor o igual al Total Hombres. \")","v":""},{"$f":"IF(E26>=Y26,\"\",\"* La celda Pueblos Originarios Mujeres debe ser menor o igual al Total Mujeres. \")","v":""},{"$f":"IF(D26>=Z26,\"\",\"* La celda Población Migrantes Hombres debe ser menor o igual al Total Hombres. \")","v":""},{"$f":"IF(E26>=AA26,\"\",\"* La celda Población Migrantes Mujeres debe ser menor o igual al Total Mujeres. \")","v":""},{"$f":"IF(AND(D26<>0,X26=\"\"),\"* No olvide escribir en las celdas de Pueblos Originarios Hombres. (Digite CERO si no tiene). \",IF(AND(E26<>0,Y26=\"\"),\"* No olvide escribir en las celdas de Pueblos Originarios Mujeres. (Digite CERO si no tiene). \",\"\"))","v":""},{"$f":"IF(AND(D26<>0,Z26=\"\"),\"* No olvide escribir en las celdas de Población Migrantes Hombres. (Digite CERO si no tiene). \",IF(AND(E26<>0,AA26=\"\"),\"* No olvide escribir en las celdas de Población Migrantes Mujeres. (Digite CERO si no tiene). \",\"\"))","v":""},null,null,null,null,null,{"$f":"IF($D26>=$X26,0,1)","v":0},{"$f":"IF($E26>=$Y26,0,1)","v":0},{"$f":"IF($D26>=$Z26,0,1)","v":0},{"$f":"IF($E26>=$AA26,0,1)","v":0},{"$f":"IF(AND(D26<>0,X26=\"\"),1,IF(AND(E26<>0,Y26=\"\"),1,0))","v":0},{"$f":"IF(AND(D26<>0,Z26=\"\"),1,IF(AND(E26<>0,AA26=\"\"),1,0))","v":0}]
["AUTOVALENTE CON RIESGO",null,{"$f":"SUM(D27:E27)","v":0},{"$f":"H27+J27+L27+N27+P27+R27+T27+V27","v":0},{"$f":"I27+K27+M27+O27+Q27+S27+U27+W27","v":0},null,null,null,null,null,null,null,null,null,null,null,null,null,null,null,null,null,null,null,null,null,null,"",null,null,null,null,null,null,null,null,null,null,null,null,null,null,null,null,null,null,null,null,null,null,null,null,null,null,null,null,null,null,null,null,null,null,null,null,null,null,null,null,null,null,null,null,null,null,null,null,null,null,null,null,{"$f":"IF(D27>=X27,\"\",\"* La celda Pueblos Originarios Hombres debe ser menor o igual al Total Hombres. \")","v":""},{"$f":"IF(E27>=Y27,\"\",\"* La celda Pueblos Originarios Mujeres debe ser menor o igual al Total Mujeres. \")","v":""},{"$f":"IF(D27>=Z27,\"\",\"* La celda Población Migrantes Hombres debe ser menor o igual al Total Hombres. \")","v":""},{"$f":"IF(E27>=AA27,\"\",\"* La celda Población Migrantes Mujeres debe ser menor o igual al Total Mujeres. \")","v":""},{"$f":"IF(AND(D27<>0,X27=\"\"),\"* No olvide escribir en las celdas de Pueblos Originarios Hombres. (Digite CERO si no tiene). \",IF(AND(E27<>0,Y27=\"\"),\"* No olvide escribir en las celdas de Pueblos Originarios Mujeres. (Digite CERO si no tiene). \",\"\"))","v":""},{"$f":"IF(AND(D27<>0,Z27=\"\"),\"* No olvide escribir en las celdas de Población Migrantes Hombres. (Digite CERO si no tiene). \",IF(AND(E27<>0,AA27=\"\"),\"* No olvide escribir en las celdas de Población Migrantes Mujeres. (Digite CERO si no tiene). \",\"\"))","v":""},null,null,null,null,null,{"$f":"IF($D27>=$X27,0,1)","v":0},{"$f":"IF($E27>=$Y27,0,1)","v":0},{"$f":"IF($D27>=$Z27,0,1)","v":0},{"$f":"IF($E27>=$AA27,0,1)","v":0},{"$f":"IF(AND(D27<>0,X27=\"\"),1,IF(AND(E27<>0,Y27=\"\"),1,0))","v":0},{"$f":"IF(AND(D27<>0,Z27=\"\"),1,IF(AND(E27<>0,AA27=\"\"),1,0))","v":0}]
["RIESGO DE DEPENDENCIA ",null,{"$f":"SUM(D28:E28)","v":0},{"$f":"H28+J28+L28+N28+P28+R28+T28+V28","v":0},{"$f":"I28+K28+M28+O28+Q28+S28+U28+W28","v":0},null,null,null,null,null,null,null,null,null,null,null,null,null,null,null,null,null,null,null,null,null,null,"",null,null,null,null,null,null,null,null,null,null,null,null,null,null,null,null,null,null,null,null,null,null,null,null,null,null,null,null,null,null,null,null,null,null,null,null,null,null,null,null,null,null,null,null,null,null,null,null,null,null,null,null,"","","","","","",null,null,null,null,null,{"$f":"IF($D28>=$X28,0,1)","v":0},{"$f":"IF($E28>=$Y28,0,1)","v":0},{"$f":"IF($D28>=$Z28,0,1)","v":0},{"$f":"IF($E28>=$AA28,0,1)","v":0},{"$f":"IF(AND(D28<>0,X28=\"\"),1,IF(AND(E28<>0,Y28=\"\"),1,0))","v":0},{"$f":"IF(AND(D28<>0,Z28=\"\"),1,IF(AND(E28<>0,AA28=\"\"),1,0))","v":0}]
["TOTAL (EFAM)",null,{"$f":"SUM(D29:E29)","v":0},{"$f":"+F29+H29+J29+L29+N29+P29+R29+T29+V29","v":0},{"$f":"+G29+I29+K29+M29+O29+Q29+S29+U29+W29","v":0},{"$f":"SUM(F26)","v":0},{"$f":"SUM(G26)","v":0},{"$f":"SUM(H26:H28)","v":0},{"$f":"SUM(I26:I28)","v":0},0,0,0,0,0,0,{"$f":"SUM(P26:P28)","v":0},0,0,0,0,0,{"$f":"SUM(V26:V28)","v":0},0,{"$f":"SUM(X26:X28)","v":0},{"$f":"SUM(Y26:Y28)","v":0},{"$f":"SUM(Z26:Z28)","v":0},{"$f":"SUM(AA26:AA28)","v":0}]
["SECCION B: POBLACIÓN BAJO CONTROL POR ESTADO NUTRICIONAL"]
["ESTADO NUTRICIONAL",null,"TOTAL",null,null,"GRUPO DE EDAD (en años) Y SEXO",null,null,null,null,null,null,null,null,null,null,null,null,null,null,null,"Pueblos Originarios",null,"Migrantes",null,"Personas Mayores en ELEAM",null,null,null,null,null,null,null,null,null,null,null,null,null,null,null,null,null,null,null,null,null,null,null,null,null,null,null,null,null,null,null,null,null,null,null,null,null,null,null,null,null,null,null,null,null,null,null,null,null,null,null,null,null,null,"Pueblos Originarios",null,"Población Migrantes",null,"Pueblos Originarios","Población Migrantes",null,null,null,null,null,"Pueblos Originarios",null,"Población Migrantes",null,"Pueblos Originarios","Población Migrantes","Personas Mayores en ELEAM",null,"Personas Mayores en ELEAM"]
[null,null,null,null,null,"65 a 69 años",null,"70 a 74 años",null,"75 a 79 años",null,"80 a 84 años",null,"85 a 89 años",null,"90 a 94 años",null,"95 a 99 años",null,"100 y mas años"]
[null,null,"Ambos\nsexos","Hombres","Mujeres","Hombres ","Mujeres","Hombres ","Mujeres","Hombres ","Mujeres","Hombres","Mujeres","Hombres ","Mujeres","Hombres ","Mujeres","Hombres","Mujeres","Hombres","Mujeres","Hombres","Mujeres","Hombres","Mujeres","Hombres","Mujeres",null,null,null,null,null,null,null,null,null,null,null,null,null,null,null,null,null,null,null,null,null,null,null,null,null,null,null,null,null,null,null,null,null,null,null,null,null,null,null,null,null,null,null,null,null,null,null,null,null,null,null,null,null,"Hombres","Mujeres","Hombres","Mujeres","No Olvide","No Olvide",null,null,null,null,null,"Hombres","Mujeres","Hombres","Mujeres","No Olvide","No Olvide","Hombres","Mujeres","No Olvide"]
["BAJO PESO",null,{"$f":"SUM(D34:E34)","v":0},{"$f":"+F34+H34+J34+L34+N34+P34+R34+T34","v":0},{"$f":"+G34+I34+K34+M34+O34+Q34+S34+U34","v":0},null,null,null,null,null,null,null,null,null,null,null,null,null,null,null,null,null,null,null,null,null,null,{"$f":"CC34&CD34&CE34&CF34&CG34&CH34&CI34&CJ34&CK34","v":""},null,null,null,null,null,null,null,null,null,null,null,null,null,null,null,null,null,null,null,null,null,null,null,null,null,null,null,null,null,null,null,null,null,null,null,null,null,null,null,null,null,null,null,null,null,null,null,null,null,null,null,null,{"$f":"IF(D34>=V34,\"\",\"* La celda Pueblos Originarios Hombres debe ser menor o igual al Total Hombres. \")","v":""},{"$f":"IF(E34>=W34,\"\",\"* La celda Pueblos Originarios Mujeres debe ser menor o igual al Total Mujeres. \")","v":""},{"$f":"IF(D34>=X34,\"\",\"* La celda Población Migrantes Hombres debe ser menor o igual al Total Hombres. \")","v":""},{"$f":"IF(E34>=Y34,\"\",\" * La celda Población Migrantes Mujeres debe ser menor o igual al Total Mujeres.\")","v":""},{"$f":"IF(AND(D34<>0,V34=\"\"),\"* No olvide escribir en la celda Pueblos Originarios Hombres (Digite CERO si no tiene). \",IF(AND(E34<>0,W34=\"\"),\"* No olvide escribir en la celda Pueblos Originarios Mujeres. (Digite CERO si no tiene). \",\"\"))","v":""},{"$f":"IF(AND(D34<>0,X34=\"\"),\"* No olvide escribir en la celda de Población Migrantes Hombres. (Digite CERO si no tiene). \",IF(AND(E34<>0,Y34=\"\"),\"* No olvide escribir en la celda de Población Migrantes Mujeres. (Digite CERO si no tiene). \",\"\"))","v":""},{"$f":"IF(D34>=Z34,\"\",\"* La celda Personas Mayores en ELEAM Hombres debe ser menor o igual al Total Hombres. \")","v":""},{"$f":"IF(E34>=AA34,\"\",\"* La celda Personas Mayores en ELEAM Mujeres debe ser menor o igual al Total Mujeres. \")","v":""},{"$f":"IF(AND(D34<>0,Z34=\"\"),\"* No olvide escribir en las celdas de Personas Mayores en ELEAM Hombres. (Digite CERO si no tiene). \",IF(AND(E34<>0,AA34=\"\"),\"* No olvide escribir en las celdas de Personas Mayores en ELEAM Mujeres. (Digite CERO si no tiene). \",\"\"))","v":""},null,null,{"$f":"IF($D34>=$V34,0,1)","v":0},{"$f":"IF($E34>=$W34,0,1)","v":0},{"$f":"IF($D34>=$X34,0,1)","v":0},{"$f":"IF($E34>=$Y34,0,1)","v":0},{"$f":"IF(AND(D34<>0,V34=\"\"),1,IF(AND(E34<>0,W34=\"\"),1,0))","v":0},{"$f":"IF(AND(D34<>0,X34=\"\"),1,IF(AND(E34<>0,Y34=\"\"),1,0))","v":0},{"$f":"IF($D34>=$Z34,0,1)","v":0},{"$f":"IF($E34>=$AA34,0,1)","v":0},{"$f":"IF(AND(D34<>0,Z34=\"\"),1,IF(AND(E34<>0,AA34=\"\"),1,0))","v":0}]
["NORMAL",null,{"$f":"SUM(D35:E35)","v":0},{"$f":"+F35+H35+J35+L35+N35+P35+R35+T35","v":0},{"$f":"+G35+I35+K35+M35+O35+Q35+S35+U35","v":0},null,null,null,null,null,null,null,null,null,null,null,null,null,null,null,null,null,null,null,null,null,null,"",null,null,null,null,null,null,null,null,null,null,null,null,null,null,null,null,null,null,null,null,null,null,null,null,null,null,null,null,null,null,null,null,null,null,null,null,null,null,null,null,null,null,null,null,null,null,null,null,null,null,null,null,{"$f":"IF(D35>=V35,\"\",\"* La celda Pueblos Originarios Hombres debe ser menor o igual al Total Hombres. \")","v":""},{"$f":"IF(E35>=W35,\"\",\"* La celda Pueblos Originarios Mujeres debe ser menor o igual al Total Mujeres. \")","v":""},{"$f":"IF(D35>=X35,\"\",\"* La celda Población Migrantes Hombres debe ser menor o igual al Total Hombres. \")","v":""},{"$f":"IF(E35>=Y35,\"\",\" * La celda Población Migrantes Mujeres debe ser menor o igual al Total Mujeres.\")","v":""},{"$f":"IF(AND(D35<>0,V35=\"\"),\"* No olvide escribir en la celda Pueblos Originarios Hombres (Digite CERO si no tiene). \",IF(AND(E35<>0,W35=\"\"),\"* No olvide escribir en la celda Pueblos Originarios Mujeres. (Digite CERO si no tiene). \",\"\"))","v":""},{"$f":"IF(AND(D35<>0,X35=\"\"),\"* No olvide escribir en la celda de Población Migrantes Hombres. (Digite CERO si no tiene). \",IF(AND(E35<>0,Y35=\"\"),\"* No olvide escribir en la celda de Población Migrantes Mujeres. (Digite CERO si no tiene). \",\"\"))","v":""},{"$f":"IF(D35>=Z35,\"\",\"* La celda Personas Mayores en ELEAM Hombres debe ser menor o igual al Total Hombres. \")","v":""},{"$f":"IF(E35>=AA35,\"\",\"* La celda Personas Mayores en ELEAM Mujeres debe ser menor o igual al Total Mujeres. \")","v":""},{"$f":"IF(AND(D35<>0,Z35=\"\"),\"* No olvide escribir en las celdas de Personas Mayores en ELEAM Hombres. (Digite CERO si no tiene). \",IF(AND(E35<>0,AA35=\"\"),\"* No olvide escribir en las celdas de Personas Mayores en ELEAM Mujeres. (Digite CERO si no tiene). \",\"\"))","v":""},null,null,{"$f":"IF($D35>=$V35,0,1)","v":0},{"$f":"IF($E35>=$W35,0,1)","v":0},{"$f":"IF($D35>=$X35,0,1)","v":0},{"$f":"IF($E35>=$Y35,0,1)","v":0},{"$f":"IF(AND(D35<>0,V35=\"\"),1,IF(AND(E35<>0,W35=\"\"),1,0))","v":0},{"$f":"IF(AND(D35<>0,X35=\"\"),1,IF(AND(E35<>0,Y35=\"\"),1,0))","v":0},{"$f":"IF($D35>=$Z35,0,1)","v":0},{"$f":"IF($E35>=$AA35,0,1)","v":0},{"$f":"IF(AND(D35<>0,Z35=\"\"),1,IF(AND(E35<>0,AA35=\"\"),1,0))","v":0}]
["SOBREPESO",null,{"$f":"SUM(D36:E36)","v":0},0,0,null,null,null,null,null,null,null,null,null,null,null,null,null,null,null,null,null,null,null,null,null,null,"",null,null,null,null,null,null,null,null,null,null,null,null,null,null,null,null,null,null,null,null,null,null,null,null,null,null,null,null,null,null,null,null,null,null,null,null,null,null,null,null,null,null,null,null,null,null,null,null,null,null,null,null,"","","","","","","","","",null,null,0,0,0,0,0,0,0,0,0]
["OBESO",null,{"$f":"SUM(D37:E37)","v":0},0,0,null,null,null,null,null,null,null,null,null,null,null,null,null,null,null,null,null,null,null,null,null,null,"",null,null,null,null,null,null,null,null,null,null,null,null,null,null,null,null,null,null,null,null,null,null,null,null,null,null,null,null,null,null,null,null,null,null,null,null,null,null,null,null,null,null,null,null,null,null,null,null,null,null,null,null,"","","","","","","","","",null,null,0,0,0,0,0,0,0,0,0]
["TOTAL ",null,{"$f":"SUM(D38:E38)","v":0},{"$f":"+F38+H38+J38+L38+N38+P38+R38+T38","v":0},{"$f":"+G38+I38+K38+M38+O38+Q38+S38+U38","v":0},{"$f":"SUM(F34:F37)","v":0},{"$f":"SUM(G34:G37)","v":0},0,0,{"$f":"SUM(J34:J37)","v":0},0,0,0,0,0,{"$f":"SUM(P34:P37)","v":0},0,0,0,0,0,{"$f":"SUM(V34:V37)","v":0},{"$f":"SUM(W34:W37)","v":0},0,0,{"$f":"SUM(Z34:Z37)","v":0},0]
["SECCION C: PERSONAS MAYORES CON SOSPECHA DE MALTRATO"]
["CONCEPTO",null,"TOTAL",null,null,"GRUPO DE EDAD (en años) Y SEXO",null,null,null,null,null,null,null,null,null,null,null,null,null,null,null,"Pueblos Originarios",null,"Migrantes",null,"Personas Mayores en ELEAM"]
[null,null,null,null,null,"65 a 69 años",null,"70 a 74 años",null,"75 a 79 años",null,"80 a 84 años",null,"85 a 89 años",null,"90 a 94 años",null,"95 a 99 años",null,"100 y mas años"]
[null,null,"Ambos\nsexos","Hombres","Mujeres","Hombres ","Mujeres","Hombres ","Mujeres","Hombres ","Mujeres","Hombres","Mujeres","Hombres","Mujeres","Hombres","Mujeres","Hombres","Mujeres","Hombres","Mujeres","Hombres","Mujeres","Hombres","Mujeres","Hombres","Mujeres"]
["PERSONAS CON SOSPECHA DE MALTRATO",null,{"$f":"SUM(D43:E43)","v":0},{"$f":"+F43+H43+J43+L43+N43+P43+R43+T43","v":0},{"$f":"+G43+I43+K43+M43+O43+Q43+S43+U43","v":0},null,null,null,null,null,null,null,null,null,null,null,null,null,null,null,null,null,null,null,null,null,null,{"$f":"CB43&CC43&CD43&CE43&CF43&CG43&CH43&CI43&CJ43&CK43","v":""},null,null,null,null,null,null,null,null,null,null,null,null,null,null,null,null,null,null,null,null,null,null,null,null,null,null,null,null,null,null,null,null,null,null,null,null,null,null,null,null,null,null,null,null,null,null,null,null,null,null,null,{"$f":"IF(C43>C21,\"* Total de personas mayores con sospecha de maltrato no puede ser mayor al Total de personas mayores en control de la sección A. \",\"\")","v":""},{"$f":"IF(D43>=V43,\"\",\"* La celda Pueblos Originarios Hombres debe ser menor o igual al Total Hombres. \")","v":""},{"$f":"IF(E43>=W43,\"\",\" * La celda Pueblos Originarios Mujeres debe ser menor o igual al Total Mujeres. \")","v":""},{"$f":"IF(D43>=X43,\"\",\"* La celda Población Migrantes Hombres debe ser menor o igual al Total Hombres. \")","v":""},{"$f":"IF(E43>=Y43,\"\",\"* La celda Población Migrantes Mujeres debe ser menor o igual al Total Mujeres. \")","v":""},{"$f":"IF(AND(D43<>0,V43=\"\"),\"* No olvide escribir en la celda Pueblos Originarios Hombres (Digite CERO si no tiene).\",IF(AND(E43<>0,W43=\"\"),\"* No olvide escribir en la celda de Pueblos Originarios Mujeres. (Digite CERO si no tiene). \",\"\"))","v":""},{"$f":"IF(AND(D43<>0,X43=\"\"),\"* No olvide escribir en la celda de Población Migrantes Hombres. (Digite CERO si no tiene). \",IF(AND(E43<>0,Y43=\"\"),\"* No olvide escribir en la celda de Población Migrantes Mujeres. (Digite CERO si no tiene). \",\"\"))","v":""},{"$f":"IF(D43>=Z43,\"\",\"* La celda Personas Mayores en ELEAM Hombres debe ser menor o igual al Total Hombres. \")","v":""},{"$f":"IF(E43>=AA43,\"\",\"* La celda Personas Mayores en ELEAM Mujeres debe ser menor o igual al Total Mujeres. \")","v":""},{"$f":"IF(AND(D43<>0,Z43=\"\"),\"* No olvide escribir en las celdas de Personas Mayores en ELEAM Hombres. (Digite CERO si no tiene). \",IF(AND(E43<>0,AA43=\"\"),\"* No olvide escribir en las celdas de Personas Mayores en ELEAM Mujeres. (Digite CERO si no tiene). \",\"\"))","v":""},null,null,{"$f":"IF($D43>=$V43,0,1)","v":0},{"$f":"IF($E43>=$W43,0,1)","v":0},{"$f":"IF($D43>=$X43,0,1)","v":0},{"$f":"IF($E43>=$Y43,0,1)","v":0},{"$f":"IF(AND(D43<>0,V43=\"\"),1,IF(AND(E43<>0,W43=\"\"),1,0))","v":0},{"$f":"IF(AND(D43<>0,X43=\"\"),1,IF(AND(E43<>0,Y43=\"\"),1,0))","v":0},{"$f":"IF(C43>C21,1,0)","v":0},{"$f":"IF($D43>=$Z43,0,1)","v":0},{"$f":"IF($E43>=$AA43,0,1)","v":0},{"$f":"IF(AND(D43<>0,Z43=\"\"),1,IF(AND(E43<>0,AA43=\"\"),1,0))","v":0}]
["SECCION D: PERSONAS MAYORES EN ACTIVIDAD FÍSICA "]
["CONCEPTO",null,"TOTAL",null,null,"GRUPO DE EDAD (en años) Y SEXO",null,null,null,null,null,null,null,null,null,null,null,null,null,null,null,"Pueblos Originarios",null,"Migrantes",null,"Personas Mayores en ELEAM"]
[null,null,null,null,null,"65 a 69 años",null,"70 a 74 años",null,"75 a 79 años",null,"80 a 84 años",null,"85 a 89 años",null,"90 a 94 años",null,"95 a 99 años",null,"100 y mas años"]
[null,null,"Ambos\nsexos","Hombres","Mujeres","Hombres ","Mujeres","Hombres ","Mujeres","Hombres ","Mujeres","Hombres","Mujeres","Hombres","Mujeres","Hombres","Mujeres","Hombres","Mujeres","Hombres","Mujeres","Hombres","Mujeres","Hombres","Mujeres","Hombres","Mujeres"]
["PERSONAS EN ACTIVIDAD FÍSICA ",null,{"$f":"SUM(D48:E48)","v":0},{"$f":"+F48+H48+J48+L48+N48+P48+R48+T48","v":0},{"$f":"+G48+I48+K48+M48+O48+Q48+S48+U48","v":0},null,null,null,null,null,null,null,null,null,null,null,null,null,null,null,null,null,null,null,null,null,null,{"$f":"CB48&CC48&CD48&CE48&CF48&CG48&CH48&CI48&CJ48&CK48","v":""},null,null,null,null,null,null,null,null,null,null,null,null,null,null,null,null,null,null,null,null,null,null,null,null,null,null,null,null,null,null,null,null,null,null,null,null,null,null,null,null,null,null,null,null,null,null,null,null,null,null,null,{"$f":"IF($C$48<=$C$15,\"\",\"* Los Adultos Mayores en actividad física no pueden ser mayor que los clasificados como Autovalentes sin/con riesgo y los riesgo de Dependencia de la Sección A. \")","v":""},{"$f":"IF(D48>=V48,\"\",\"* La celda Pueblos Originarios Hombres debe ser menor o igual al Total Hombres. \")","v":""},{"$f":"IF(E48>=W48,\"\",\" * La celda Pueblos Originarios Mujeres debe ser menor o igual al Total Mujeres. \")","v":""},{"$f":"IF(D48>=X48,\"\",\"* La celda Población Migrantes Hombres debe ser menor o igual al Total Hombres. \")","v":""},{"$f":"IF(E48>=Y48,\"\",\"* La celda Población Migrantes Mujeres debe ser menor o igual al Total Mujeres. \")","v":""},{"$f":"IF(AND(D48<>0,V48=\"\"),\"* No olvide escribir en la celda Pueblos Originarios Hombres (Digite CERO si no tiene).\",IF(AND(E48<>0,W48=\"\"),\"* No olvide escribir en la celda de Pueblos Originarios Mujeres. (Digite CERO si no tiene). \",\"\"))","v":""},{"$f":"IF(AND(D48<>0,X48=\"\"),\"* No olvide escribir en la celda de Población Migrantes Hombres. (Digite CERO si no tiene). \",IF(AND(E48<>0,Y48=\"\"),\"* No olvide escribir en la celda de Población Migrantes Mujeres. (Digite CERO si no tiene). \",\"\"))","v":""},{"$f":"IF(D48>=Z48,\"\",\"* La celda Personas Mayores en ELEAM Hombres debe ser menor o igual al Total Hombres. \")","v":""},{"$f":"IF(E48>=AA48,\"\",\"* La celda Personas Mayores en ELEAM Mujeres debe ser menor o igual al Total Mujeres. \")","v":""},{"$f":"IF(AND(D48<>0,Z48=\"\"),\"* No olvide escribir en las celdas de Personas Mayores en ELEAM Hombres. (Digite CERO si no tiene). \",IF(AND(E48<>0,AA48=\"\"),\"* No olvide escribir en las celdas de Personas Mayores en ELEAM Mujeres. (Digite CERO si no tiene). \",\"\"))","v":""},null,null,{"$f":"IF($D48>=$V48,0,1)","v":0},{"$f":"IF($E48>=$W48,0,1)","v":0},{"$f":"IF($D48>=$X48,0,1)","v":0},{"$f":"IF($E48>=$Y48,0,1)","v":0},{"$f":"IF(AND(D48<>0,V48=\"\"),1,IF(AND(E48<>0,W48=\"\"),1,0))","v":0},{"$f":"IF(AND(D48<>0,X48=\"\"),1,IF(AND(E48<>0,Y48=\"\"),1,0))","v":0},{"$f":"IF($C48<=$C$15,0,1)","v":0},{"$f":"IF($D48>=$Z48,0,1)","v":0},{"$f":"IF($E48>=$AA48,0,1)","v":0},{"$f":"IF(AND(D48<>0,Z48=\"\"),1,IF(AND(E48<>0,AA48=\"\"),1,0))","v":0}]
["SECCION E: PERSONAS MAYORES CON RIESGO DE CAÍDAS"]
["INSTRUMENTO DE EVALUACIÓN","TIPO DE RIESGO","TOTAL",null,null,"GRUPO DE EDAD (en años) Y SEXO",null,null,null,null,null,null,null,null,null,null,null,null,null,null,null,"Pueblos Originarios",null,"Migrantes",null,"Personas Mayores en ELEAM"]
[null,null,null,null,null,"65 a 69 años",null,"70 a 74 años",null,"75 a 79 años",null,"80 a 84 años",null,"85 a 89 años",null,"90 a 94 años",null,"95 a 99 años",null,"100 y mas años"]
[null,null,"Ambos\nsexos","Hombres","Mujeres","Hombres ","Mujeres","Hombres ","Mujeres","Hombres ","Mujeres","Hombres","Mujeres","Hombres","Mujeres","Hombres","Mujeres","Hombres","Mujeres","Hombres","Mujeres","Hombres","Mujeres","Hombres","Mujeres","Hombres","Mujeres"]
["TIMED UP AND GO","Normal",{"$f":"SUM(D53:E53)","v":0},{"$f":"+F53+H53+J53+L53+N53+P53+R53+T53","v":0},{"$f":"+G53+I53+K53+M53+O53+Q53+S53+U53","v":0},null,null,null,null,null,null,null,null,null,null,null,null,null,null,null,null,null,null,null,null,null,null,{"$f":"CB53&CC53&CD53&CE53&CF53&CG53&CH53&CI53&CJ53&CK53","v":""},null,null,null,null,null,null,null,null,null,null,null,null,null,null,null,null,null,null,null,null,null,null,null,null,null,null,null,null,null,null,null,null,null,null,null,null,null,null,null,null,null,null,null,null,null,null,null,null,null,null,null,null,{"$f":"IF(D53>=V53,\"\",\"* La celda Pueblos Originarios Hombres debe ser menor o igual al Total Hombres. \")","v":""},{"$f":"IF(E53>=W53,\"\",\" * La celda Pueblos Originarios Mujeres debe ser menor o igual al Total Mujeres. \")","v":""},{"$f":"IF(D53>=X53,\"\",\"* La celda Población Migrantes Hombres debe ser menor o igual al Total Hombres. \")","v":""},{"$f":"IF(E53>=Y53,\"\",\"* La celda Población Migrantes Mujeres debe ser menor o igual al Total Mujeres. \")","v":""},{"$f":"IF(AND(D53<>0,V53=\"\"),\"* No olvide escribir en la celda Pueblos Originarios Hombres (Digite CERO si no tiene).\",IF(AND(E53<>0,W53=\"\"),\"* No olvide escribir en la celda de Pueblos Originarios Mujeres. (Digite CERO si no tiene). \",\"\"))","v":""},{"$f":"IF(AND(D53<>0,X53=\"\"),\"* No olvide escribir en la celda de Población Migrantes Hombres. (Digite CERO si no tiene). \",IF(AND(E53<>0,Y53=\"\"),\"* No olvide escribir en la celda de Población Migrantes Mujeres. (Digite CERO si no tiene). \",\"\"))","v":""},{"$f":"IF(D53>=Z53,\"\",\"* La celda Personas Mayores en ELEAM Hombres debe ser menor o igual al Total Hombres. \")","v":""},{"$f":"IF(E53>=AA53,\"\",\"* La celda Personas Mayores en ELEAM Mujeres debe ser menor o igual al Total Mujeres. \")","v":""},{"$f":"IF(AND(D53<>0,Z53=\"\"),\"* No olvide escribir en las celdas de Personas Mayores en ELEAM Hombres. (Digite CERO si no tiene). \",IF(AND(E53<>0,AA53=\"\"),\"* No olvide escribir en las celdas de Personas Mayores en ELEAM Mujeres. (Digite CERO si no tiene). \",\"\"))","v":""},null,null,{"$f":"IF($D53>=$V53,0,1)","v":0},{"$f":"IF($E53>=$W53,0,1)","v":0},{"$f":"IF($D53>=$X53,0,1)","v":0},{"$f":"IF($E53>=$Y53,0,1)","v":0},{"$f":"IF(AND(D53<>0,V53=\"\"),1,IF(AND(E53<>0,W53=\"\"),1,0))","v":0},{"$f":"IF(AND(D53<>0,X53=\"\"),1,IF(AND(E53<>0,Y53=\"\"),1,0))","v":0},{"$f":"IF($D53>=$Z53,0,1)","v":0},{"$f":"IF($E53>=$AA53,0,1)","v":0},{"$f":"IF(AND(D53<>0,Z53=\"\"),1,IF(AND(E53<>0,AA53=\"\"),1,0))","v":0}]
[null,"Leve",{"$f":"SUM(D54:E54)","v":0},{"$f":"+F54+H54+J54+L54+N54+P54+R54+T54","v":0},{"$f":"+G54+I54+K54+M54+O54+Q54+S54+U54","v":0},null,null,null,null,null,null,null,null,null,null,null,null,null,null,null,null,null,null,null,null,null,null,{"$f":"CB54&CC54&CD54&CE54&CF54&CG54&CH54&CI54&CJ54&CK54","v":""},null,null,null,null,null,null,null,null,null,null,null,null,null,null,null,null,null,null,null,null,null,null,null,null,null,null,null,null,null,null,null,null,null,null,null,null,null,null,null,null,null,null,null,null,null,null,null,null,null,null,null,null,"","","","","","","","","",null,null,{"$f":"IF($D54>=$V54,0,1)","v":0},{"$f":"IF($E54>=$W54,0,1)","v":0},{"$f":"IF($D54>=$X54,0,1)","v":0},{"$f":"IF($E54>=$Y54,0,1)","v":0},{"$f":"IF(AND(D54<>0,V54=\"\"),1,IF(AND(E54<>0,W54=\"\"),1,0))","v":0},{"$f":"IF(AND(D54<>0,X54=\"\"),1,IF(AND(E54<>0,Y54=\"\"),1,0))","v":0},{"$f":"IF($D54>=$Z54,0,1)","v":0},{"$f":"IF($E54>=$AA54,0,1)","v":0},{"$f":"IF(AND(D54<>0,Z54=\"\"),1,IF(AND(E54<>0,AA54=\"\"),1,0))","v":0}]
[null,"Alto",{"$f":"SUM(D55:E55)","v":0},{"$f":"+F55+H55+J55+L55+N55+P55+R55+T55","v":0},0,null,null,null,null,null,null,null,null,null,null,null,null,null,null,null,null,null,null,null,null,null,null,"",null,null,null,null,null,null,null,null,null,null,null,null,null,null,null,null,null,null,null,null,null,null,null,null,null,null,null,null,null,null,null,null,null,null,null,null,null,null,null,null,null,null,null,null,null,null,null,null,null,null,null,{"$f":"IF(SUM($C53:$C55)>$C15,\"* La suma de adultos mayores con Riesgo de caída deben ser menor o igual al Total Adultos Mayores con EFAM de la sección A. \",\"\")","v":""},"","","","","","","","","",null,null,{"$f":"IF($D55>=$V55,0,1)","v":0},{"$f":"IF($E55>=$W55,0,1)","v":0},{"$f":"IF($D55>=$X55,0,1)","v":0},{"$f":"IF($E55>=$Y55,0,1)","v":0},{"$f":"IF(AND(D55<>0,V55=\"\"),1,IF(AND(E55<>0,W55=\"\"),1,0))","v":0},{"$f":"IF(AND(D55<>0,X55=\"\"),1,IF(AND(E55<>0,Y55=\"\"),1,0))","v":0},{"$f":"IF($D55>=$Z55,0,1)","v":0},{"$f":"IF($E55>=$AA55,0,1)","v":0},{"$f":"IF(AND(D55<>0,Z55=\"\"),1,IF(AND(E55<>0,AA55=\"\"),1,0))","v":0},{"$f":"IF(SUM($C$53:$C$55)>$C$15,1,0)","v":0}]
["ESTACIÓN UNIPODAL","Normal ",{"$f":"SUM(D56:E56)","v":0},{"$f":"+F56+H56+J56+L56+N56+P56+R56+T56","v":0},0,null,null,null,null,null,null,null,null,null,null,null,null,null,null,null,null,null,null,null,null,null,null,"",null,null,null,null,null,null,null,null,null,null,null,null,null,null,null,null,null,null,null,null,null,null,null,null,null,null,null,null,null,null,null,null,null,null,null,null,null,null,null,null,null,null,null,null,null,null,null,null,null,null,null,null,"","","","","","","","","",null,null,{"$f":"IF($D56>=$V56,0,1)","v":0},{"$f":"IF($E56>=$W56,0,1)","v":0},{"$f":"IF($D56>=$X56,0,1)","v":0},{"$f":"IF($E56>=$Y56,0,1)","v":0},{"$f":"IF(AND(D56<>0,V56=\"\"),1,IF(AND(E56<>0,W56=\"\"),1,0))","v":0},{"$f":"IF(AND(D56<>0,X56=\"\"),1,IF(AND(E56<>0,Y56=\"\"),1,0))","v":0},{"$f":"IF($D56>=$Z56,0,1)","v":0},{"$f":"IF($E56>=$AA56,0,1)","v":0},{"$f":"IF(AND(D56<>0,Z56=\"\"),1,IF(AND(E56<>0,AA56=\"\"),1,0))","v":0}]
[null,"Alterado",{"$f":"SUM(D57:E57)","v":0},{"$f":"+F57+H57+J57+L57+N57+P57+R57+T57","v":0},0,null,null,null,null,null,null,null,null,null,null,null,null,null,null,null,null,null,null,null,null,null,null,"",null,null,null,null,null,null,null,null,null,null,null,null,null,null,null,null,null,null,null,null,null,null,null,null,null,null,null,null,null,null,null,null,null,null,null,null,null,null,null,null,null,null,null,null,null,null,null,null,null,null,null,null,"","","","","","","","","",null,null,0,0,0,0,0,0,0,0,0]
[]
[]
[]
[]
[]
[]
[]
[]
[]
[]
[]
[]
[]
[]
[]
[]
[]
[]
[]
[]
[]
[]
[]
[{"$f":"SUM(C12:C21, C26:C28,C34:C37,C43:C43,C48:C48,C53:C57)","v":0},"datos"]
[{"$f":"SUM(CN12:CW57)","v":0},"errores"]

{"sheet":"P6","index":6,"n_rows":138,"n_cols":126,"rows_kept":138,"cut":false,"hidden":false,"merged":[[56,29,56,30],[56,17,56,18],[56,19,56,20],[10,21,10,22],[16,0,16,1],[71,0,72,0],[70,0,70,1],[61,0,63,1],[55,2,56,4],[42,0,42,1],[12,0,12,1],[13,0,13,1],[14,0,15,0],[17,0,18,0],[45,0,45,1],[46,0,46,1],[44,0,44,1],[47,0,51,0],[55,0,57,0],[55,1,57,1],[53,0,53,1],[19,0,19,1],[20,0,24,0],[25,0,29,0],[30,0,33,0],[39,0,41,0],[34,0,38,0],[61,5,61,14],[61,2,62,4],[62,5,62,6],[62,7,62,8],[62,9,62,10],[67,11,67,12],[67,13,67,14],[56,11,56,12],[56,13,56,14],[73,0,73,1],[64,0,64,1],[69,0,69,1],[67,9,67,10],[65,0,65,14],[66,0,68,1],[66,2,67,4],[112,1,114,1],[87,0,90,0],[76,0,76,1],[82,0,86,0],[96,0,98,0],[101,0,101,1],[103,0,103,1],[77,0,81,0],[91,0,95,0],[110,0,110,1],[112,0,114,0],[104,0,108,0],[102,0,102,1],[99,0,99,1],[74,0,75,0],[112,2,113,4],[113,7,113,8],[6,0,6,20],[8,7,8,8],[8,9,8,10],[8,11,8,12],[9,0,11,1],[9,2,10,4],[8,0,8,6],[8,13,8,14],[8,15,8,16],[8,17,8,18],[9,5,9,38],[10,19,10,20],[8,19,8,20],[10,11,10,12],[8,21,8,22],[8,23,8,24],[10,35,10,36],[10,29,10,30],[10,31,10,32],[10,33,10,34],[8,31,8,32],[8,37,8,38],[10,37,10,38],[10,9,10,10],[113,19,113,20],[113,21,113,22],[62,11,62,12],[67,17,67,18],[67,15,67,16],[67,23,67,24],[67,19,67,20],[113,13,113,14],[61,15,62,16],[66,5,66,38],[113,11,113,12],[113,15,113,16],[113,17,113,18],[113,37,113,38],[113,25,113,26],[113,27,113,28],[113,29,113,30],[113,31,113,32],[113,33,113,34],[113,35,113,36],[67,27,67,28],[112,5,112,38],[113,23,113,24],[113,5,113,6],[113,9,113,10],[67,31,67,32],[67,25,67,26],[67,33,67,34],[67,37,67,38],[67,21,67,22],[67,5,67,6],[67,7,67,8],[8,35,8,36],[10,5,10,6],[10,7,10,8],[56,15,56,16],[56,31,56,32],[56,33,56,34],[8,27,8,28],[8,25,8,26],[8,29,8,30],[8,33,8,34],[56,35,56,36],[55,5,55,38],[56,5,56,6],[56,7,56,8],[56,9,56,10],[56,37,56,38],[67,35,67,36],[67,29,67,30],[66,43,67,44],[66,39,68,39],[66,40,68,40],[66,41,67,42],[66,47,68,47],[66,46,68,46],[66,48,67,49],[66,45,68,45],[10,86,11,86],[10,88,10,89],[10,85,11,85],[10,81,10,82],[10,83,10,84],[10,13,10,14],[10,15,10,16],[9,40,11,40],[62,13,62,14],[9,48,10,49],[9,39,11,39],[9,45,11,45],[9,43,10,44],[9,47,11,47],[10,27,10,28],[10,23,10,24],[10,17,10,18],[56,21,56,22],[9,46,11,46],[9,41,10,42],[56,23,56,24],[56,25,56,26],[56,27,56,28],[10,25,10,26],[10,93,10,94],[10,95,10,96],[10,112,11,112],[10,125,11,125],[10,123,11,123],[10,124,11,124],[67,112,68,112],[67,123,68,123],[67,124,68,124],[67,125,68,125],[67,110,68,110],[67,111,68,111]]}
["DATOS DEL ESTABLECIMIENTO"]
[{"$f":"CONCATENATE(\"COMUNA: \",NOMBRE!$B$2,\" - \",\"( \",NOMBRE!$C$2,NOMBRE!$D$2,NOMBRE!$E$2,NOMBRE!$F$2,NOMBRE!$G$2,\" )\")","v":"COMUNA:  - (  )"}]
[{"$f":"CONCATENATE(\"ESTABLECIMIENTO/ESTRATEGIA: \",NOMBRE!$B$3,\" - \",\"( \",NOMBRE!$C$3,NOMBRE!$D$3,NOMBRE!$E$3,NOMBRE!$F$3,NOMBRE!$G$3,NOMBRE!$H$3,\" )\")","v":"ESTABLECIMIENTO/ESTRATEGIA:  - (  )"}]
[{"$f":"CONCATENATE(\"MES: \",NOMBRE!$B$6,\" - \",\"( \",NOMBRE!$C$6,NOMBRE!$D$6,\" )\")","v":"MES:  - (  )"}]
[{"$f":"CONCATENATE(\"AÑO: \",NOMBRE!$B$7)","v":"AÑO: 2024"}]
[]
["REM-P6. POBLACIÓN EN CONTROL PROGRAMA DE SALUD MENTAL EN ATENCIÓN PRIMARIA Y ESPECIALIDAD"]
["A. ATENCIÓN PRIMARIA"]
["SECCION A.1: POBLACIÓN EN CONTROL EN APS AL CORTE"]
["CONCEPTO",null,"T O T A L",null,null,"GRUPO DE EDAD (en años)",null,null,null,null,null,null,null,null,null,null,null,null,null,null,null,null,null,null,null,null,null,null,null,null,null,null,null,null,null,null,null,null,null,"Gestantes","Madre de Hijo menor de 5 años ","Pueblos Originarios",null," Migrantes",null,"Niños, Niñas, Adolescentes y Jóvenes SENAME","Niños, Niñas, Adolescentes y Jóvenes Mejor Niñez","Plan Cuidado Integral Elaborado","TRANS "]
[null,null,null,null,null,"0 a 4 años",null,"5 a 9 años",null,"10 a 14 años",null,"15 a 19 años",null,"20 a 24 años",null,"25 a 29 años",null,"30 a 34 años",null,"35 a 39 años",null,"40 a 44 años",null,"45 a 49 años",null,"50 a 54 años",null,"55 a 59 años",null,"60 a 64 años",null,"65 a 69 años",null,"70 a 74 años",null,"75 a 79 años",null,"80 y más años",null,null,null,null,null,null,null,null,null,null,null,null,null,null,null,null,null,null,null,null,null,null,null,null,null,null,null,null,null,null,null,null,null,null,null,null,null,null,null,null,null,"Gestantes","Madre de hijos","Pueblos originarios",null,"Poblacion Migrantes",null,"Niños y niñas SENAME","Niños y niñas Mejor Niñez","Plan Cuidado Integral Elaborado","Trans",null,null,"Gestantes","Madre de hijos","Pueblos originarios",null,"Poblacion Migrantes",null,"Niños, Niñas, Adolescentes y Jóvenes SENAME","Niños, Niñas, Adolescentes y Jóvenes Mejor Niñez","Plan Cuidado Integral Elaborado",null,null,null,null,"Gestantes","Madre de hijos","Pueblos originarios","Pueblos originarios","Poblacion Migrantes","Poblacion Migrantes","Niños y niñas SENAME","Niños y niñas Mejor Niñez","Plan Cuidado Integral Elaborado",null,"TRANS","TRANS",null,"Gestantes","Madre de hIjos","Pueblos originarios","Pueblos originarios","Poblacion Migrantes","Poblacion Migrantes","Niños y niñas SENAME","Niños y niñas Mejor Niñez","Plan Cuidado Integral Elaborado"]
[null,null,"Ambos\nsexos","Hombres","Mujeres","Hombres","Mujeres","Hombres","Mujeres","Hombres","Mujeres","Hombres","Mujeres","Hombres","Mujeres","Hombres","Mujeres","Hombres","Mujeres","Hombres","Mujeres","Hombres","Mujeres","Hombres","Mujeres","Hombres","Mujeres","Hombres","Mujeres","Hombres","Mujeres","Hombres ","Mujeres","Hombres ","Mujeres","Hombres ","Mujeres","Hombres","Mujeres",null,null,"Hombres","Mujeres","Hombres","Mujeres",null,null,null,"Masculino","Femenino ",null,null,null,null,null,null,null,null,null,null,null,null,null,null,null,null,null,null,null,null,null,null,null,null,null,null,null,null,null,null,null,"Hombres","Mujeres","Hombres","Mujeres",null,null,null,"Masculino","Femenino",null,"No Olvide","No Olvide","No Olvide Hombres","No Olvide Mujeres","No Olvide Hombres","No Olvide Mujeres","No Olvide","No Olvide","No Olvide",null,null,null,null,null,null,"Hombres","Mujeres","Hombres","Mujeres",null,null,null,null,"Masculino","Femenino",null,"No Olvide","No Olvide","Hombres","Mujeres","Hombres","Mujeres"]
["NUMERO DE PERSONAS EN CONTROL EN EL PROGRAMA",null,{"$f":"SUM(D13:E13)","v":0},{"$f":"+F13+H13+J13+L13+N13+P13+R13+T13+V13+X13+Z13+AB13+AD13+AF13+AH13+AJ13+AL13","v":0},{"$f":"+G13+I13+K13+M13+O13+Q13+S13+U13+W13+Y13+AA13+AC13+AE13+AG13+AI13+AK13+AM13","v":0},null,null,null,null,null,null,null,null,null,null,null,null,null,null,null,null,null,null,null,null,null,null,null,null,null,null,null,null,null,null,null,null,null,null,null,null,null,null,null,null,null,null,null,null,null,{"$f":"CB13&CC13&CD13&CE13&CF13&CG13&CH13&CI13&CJ13&CK13&CL13&CN13&CO13&CP13&CQ13&CR13&CS13&CT13&CU13&CV13","v":""},null,null,null,null,null,null,null,null,null,null,null,null,null,null,null,null,null,null,null,null,null,null,null,null,null,null,null,null,{"$f":"IF($AN13>$E13,\"* La celda 'Gestantes' debe ser menor o igual al Total de Mujeres en control. \",\"\")","v":""},{"$f":"IF($AO13>$E13,\"* La celda 'Madres de Hijos menor de 5 años' debe ser menor o igual al Total de Mujeres en control. \",\"\")","v":""},{"$f":"IF(($AP13)>$D13,\"* La celda 'Pueblos Originarios / Hombres' debe ser menor o igual al Total de Hombres en control. \",\"\")","v":""},{"$f":"IF($AQ13>$E13,\"* La celda 'Pueblos Originarios / Mujeres' debe ser menor o igual al Total de Mujeres en control. \",\"\")","v":""},{"$f":"IF(($AR13)>$D13,\"* La celda 'Población Migrantes / Hombres' debe ser menor o igual al Total de Hombres en control. \",\"\")","v":""},{"$f":"IF($AS13>$E13,\"* La celda 'Población Migrantes / Mujeres' debe ser menor o igual al Total de Mujeres en control. \",\"\")","v":""},{"$f":"IF($AT13>$C13,\"* La celda 'Niños, Niñas, Adolescentes y Jóvenes de Población SENAME' debe ser menor o igual al Total de Ambos Sexos. \",\"\")","v":""},{"$f":"IF($AU13>$C13,\"* La celda 'Niños, Niñas, Adolescentes y Jóvenes Mejor Niñez' debe ser menor o igual al Total de Ambos Sexos. \",\"\")","v":""},{"$f":"IF($AV13>$C13,\"* La celda 'Plan Cuidado Integral Elaborado' debe ser menor o igual al Total de Personas en control. \",\"\")","v":""},{"$f":"IF(AND(E13>0,OR(AW13=\"\")),\" * No olvide digitar la variable Trans Masculino. (Digite Cero si no tiene).\",IF(AW13>E13,\" * La variable Trans Masculino no debe ser mayor al Total Mujeres.\",\"\"))","v":""},{"$f":"IF(AND(D13>0,OR(AX13=\"\")),\" * No olvide digitar la variable Trans Femenino. (Digite Cero si no tiene).\",IF(AX13>D13,\" * La variable Trans Femenino no debe ser mayor al Total Hombre.\",\"\"))","v":""},null,{"$f":"IF(AND($E13<>0,$AN13=\"\"),\"* No olvide escribir en la celda de 'Gestantes' (Digite CERO si no tiene). \",\"\")","v":""},{"$f":"IF(AND($E13<>0,$AO13=\"\"),\"* No olvide escribir en la celda de 'Madres de Hijos menor de 5 años' (Digite CERO si no tiene). \",\"\")","v":""},{"$f":"IF(AND($D13<>0,$AP13=\"\"),\"* No olvide escribir en las celdas de Pueblos Originarios Hombres. (Digite CERO si no tiene).  \",\"\")","v":""},{"$f":"IF(AND($E13<>0,$AQ13=\"\"),\"* No olvide escribir en las celdas de Pueblos Originarios Mujeres (Digite CERO si no tiene).  \",\"\")","v":""},{"$f":"IF(AND($D13<>0,$AR13=\"\"),\"* No olvide escribir en las celdas de Población Migrantes Hombres. (Digite CERO si no tiene). \",\"\")","v":""},{"$f":"IF(AND($E13<>0,$AS13=\"\"),\"* No olvide escribir en las celdas de Población Migrantes Mujeres. (Digite CERO si no tiene). \",\"\")","v":""},{"$f":"IF(AND($C13<>0,$AT13=\"\"),\"* No olvide escribir en la celda de Niños, Niñas, Adolescentes y Jóvenes SENAME. (Digite CERO si no tiene). \",\"\")","v":""},{"$f":"IF(AND($C13<>0,$AU13=\"\"),\"* No olvide escribir en la celda Niños, Niñas, Adolescentes y Jóvenes Mejor Niñez. (Digite CERO si no tiene). \",\"\")","v":""},{"$f":"IF(AND($C13<>0,$AV13=\"\"),\"* No olvide escribir en la celda Plan Cuidado integral Elaborado. (Digite CERO si no tiene). \",\"\")","v":""},null,null,null,null,{"$f":"IF($AN13>$E13,1,0)","v":0},{"$f":"IF($AO13>$E13,1,0)","v":0},{"$f":"IF(($AP13)>$D13,1,0)","v":0},{"$f":"IF($AQ13>$E13,1,0)","v":0},{"$f":"IF(($AR13)>$D13,1,0)","v":0},{"$f":"IF($AS13>$E13,1,0)","v":0},{"$f":"IF($AT13>$C13,1,0)","v":0},{"$f":"IF($AU13>$C13,1,0)","v":0},{"$f":"IF($AV13>$C13,1,0)","v":0},null,{"$f":"IF(AND(E13>0,OR(AW13=\"\")),1,IF((AW13)>E13,1,0))","v":0},{"$f":"IF(AND(D13>0,OR(AX13=\"\")),1,IF((AX13)>D13,1,0))","v":0},null,{"$f":"IF(AND($E13<>0,$AN13=\"\"),1,0)","v":0},{"$f":"IF(AND($E13<>0,$AO13=\"\"),1,0)","v":0},{"$f":"IF(AND($D13<>0,$AP13=\"\"),1,0)","v":0},null,{"$f":"IF(AND(D13<>0,AR13=\"\"),1,0)","v":0},{"$f":"IF(AND(E13<>0,AS13=\"\"),1,0)","v":0},{"$f":"IF(AND($C13<>0,AT13=\"\"),1,0)","v":0},{"$f":"IF(AND($C13<>0,AU13=\"\"),1,0)","v":0},{"$f":"IF(AND($C13<>0,AV13=\"\"),1,0)","v":0}]
["FACTORES DE RIESGO Y CONDICIONANTES DE LA SALUD MENTAL"]
["VIOLENCIA ","VICTIMA",{"$f":"SUM(D15:E15)","v":0},{"$f":"+F15+H15+J15+L15+N15+P15+R15+T15+V15+X15+Z15+AB15+AD15+AF15+AH15+AJ15+AL15","v":0},{"$f":"+G15+I15+K15+M15+O15+Q15+S15+U15+W15+Y15+AA15+AC15+AE15+AG15+AI15+AK15+AM15","v":0},null,null,null,null,null,null,null,null,null,null,null,null,null,null,null,null,null,null,null,null,null,null,null,null,null,null,null,null,null,null,null,null,null,null,null,null,null,null,null,null,null,null,null,null,null,{"$f":"$CB15&CC15&CD15&CE15&CF15&CG15&CH15&CI15&CJ15&CK15&CL15&CN15&CO15&CP15&CQ15&CR15&CS15&CT15&CU15&CV15","v":""},null,null,null,null,null,null,null,null,null,null,null,null,null,null,null,null,null,null,null,null,null,null,null,null,null,null,null,null,{"$f":"IF($AN15>$E15,\"* La celda 'Gestantes' debe ser menor o igual al Total de Mujeres en control. \",\"\")","v":""},{"$f":"IF($AO15>$E15,\"* La celda 'Madres de Hijos menor de 5 años' debe ser menor o igual al Total de Mujeres en control. \",\"\")","v":""},{"$f":"IF(($AP15)>$D15,\"* La celda 'Pueblos Originarios / Hombres' debe ser menor o igual al Total de Hombres en control. \",\"\")","v":""},{"$f":"IF($AQ15>$E15,\"* La celda 'Pueblos Originarios / Mujeres' debe ser menor o igual al Total de Mujeres en control. \",\"\")","v":""},{"$f":"IF(($AR15)>$D15,\"* La celda 'Población Migrantes / Hombres' debe ser menor o igual al Total de Hombres en control. \",\"\")","v":""},{"$f":"IF($AS15>$E15,\"* La celda 'Población Migrantes / Mujeres' debe ser menor o igual al Total de Mujeres en control. \",\"\")","v":""},{"$f":"IF($AT15>$C15,\"* La celda 'Niños, Niñas, Adolescentes y Jóvenes de Población SENAME' debe ser menor o igual al Total de Ambos Sexos. \",\"\")","v":""},{"$f":"IF($AU15>$C15,\"* La celda 'Niños, Niñas, Adolescentes y Jóvenes Mejor Niñez' debe ser menor o igual al Total de Ambos Sexos. \",\"\")","v":""},{"$f":"IF($AV15>$C15,\"* La celda 'Plan Cuidado Integral Elaborado' debe ser menor o igual al Total de Personas en control. \",\"\")","v":""},{"$f":"IF(AND(E15>0,OR(AW15=\"\")),\" * No olvide digitar la variable Trans Masculino. (Digite Cero si no tiene).\",IF(AW15>E15,\" * La variable Trans Masculino no debe ser mayor al Total Mujeres.\",\"\"))","v":""},{"$f":"IF(AND(D15>0,OR(AX15=\"\")),\" * No olvide digitar la variable Trans Femenino. (Digite Cero si no tiene).\",IF(AX15>D15,\" * La variable Trans Femenino no debe ser mayor al Total Hombre.\",\"\"))","v":""},null,{"$f":"IF(AND($E15<>0,$AN15=\"\"),\"* No olvide escribir en la celda de 'Gestantes' (Digite CERO si no tiene). \",\"\")","v":""},{"$f":"IF(AND($E15<>0,$AO15=\"\"),\"* No olvide escribir en la celda de 'Madres de Hijos menor de 5 años' (Digite CERO si no tiene). \",\"\")","v":""},{"$f":"IF(AND($D15<>0,$AP15=\"\"),\"* No olvide escribir en las celdas de Pueblos Originarios Hombres. (Digite CERO si no tiene).  \",\"\")","v":""},{"$f":"IF(AND($E15<>0,$AQ15=\"\"),\"* No olvide escribir en las celdas de Pueblos Originarios Mujeres (Digite CERO si no tiene).  \",\"\")","v":""},{"$f":"IF(AND($D15<>0,$AR15=\"\"),\"* No olvide escribir en las celdas de Población Migrantes Hombres. (Digite CERO si no tiene). \",\"\")","v":""},{"$f":"IF(AND($E15<>0,$AS15=\"\"),\"* No olvide escribir en las celdas de Población Migrantes Mujeres. (Digite CERO si no tiene). \",\"\")","v":""},{"$f":"IF(AND($C15<>0,$AT15=\"\"),\"* No olvide escribir en la celda de Niños, Niñas, Adolescentes y Jóvenes SENAME. (Digite CERO si no tiene). \",\"\")","v":""},{"$f":"IF(AND($C15<>0,$AU15=\"\"),\"* No olvide escribir en la celda Niños, Niñas, Adolescentes y Jóvenes Mejor Niñez. (Digite CERO si no tiene). \",\"\")","v":""},{"$f":"IF(AND($C15<>0,$AV15=\"\"),\"* No olvide escribir en la celda Plan Cuidado integral Elaborado. (Digite CERO si no tiene). \",\"\")","v":""},null,null,null,null,{"$f":"IF($AN15>$E15,1,0)","v":0},{"$f":"IF($AO15>$E15,1,0)","v":0},{"$f":"IF(($AP15)>$D15,1,0)","v":0},{"$f":"IF($AQ15>$E15,1,0)","v":0},{"$f":"IF(($AR15)>$D15,1,0)","v":0},{"$f":"IF($AS15>$E15,1,0)","v":0},{"$f":"IF($AT15>$C15,1,0)","v":0},{"$f":"IF($AU15>$C15,1,0)","v":0},{"$f":"IF($AV15>$C15,1,0)","v":0},null,{"$f":"IF(AND(E15>0,OR(AW15=\"\")),1,IF((AW15)>E15,1,0))","v":0},{"$f":"IF(AND(D15>0,OR(AX15=\"\")),1,IF((AX15)>D15,1,0))","v":0},null,{"$f":"IF(AND($E15<>0,$AN15=\"\"),1,0)","v":0},{"$f":"IF(AND($E15<>0,$AO15=\"\"),1,0)","v":0},{"$f":"IF(AND($D15<>0,$AP15=\"\"),1,IF(AND($E15<>0,$AQ15=\"\"),1,0))","v":0},null,{"$f":"IF(AND(D15<>0,AR15=\"\"),1,0)","v":0},{"$f":"IF(AND(E15<>0,AS15=\"\"),1,0)","v":0},{"$f":"IF(AND($C15<>0,AT15=\"\"),1,0)","v":0},{"$f":"IF(AND($C15<>0,AU15=\"\"),1,0)","v":0},{"$f":"IF(AND($C15<>0,AV15=\"\"),1,0)","v":0}]
[null,"AGRESOR/A",0,0,0,null,null,null,null,null,null,null,null,null,null,null,null,null,null,null,null,null,null,null,null,null,null,null,null,null,null,null,null,null,null,null,null,null,null,null,null,null,null,null,null,null,null,null,null,null,{"$f":"$CB16&CC16&CD16&CE16&CF16&CG16&CH16&CI16&CJ16&CK16&CL16&CN16&CO16&CP16&CQ16&CR16&CS16&CT16&CU16&CV16","v":""},null,null,null,null,null,null,null,null,null,null,null,null,null,null,null,null,null,null,null,null,null,null,null,null,null,null,null,null,"","","","","","","","","",{"$f":"IF(AND(E16>0,OR(AW16=\"\")),\" * No olvide digitar la variable Trans Masculino. (Digite Cero si no tiene).\",IF(AW16>E16,\" * La variable Trans Masculino no debe ser mayor al Total Mujeres.\",\"\"))","v":""},{"$f":"IF(AND(D16>0,OR(AX16=\"\")),\" * No olvide digitar la variable Trans Femenino. (Digite Cero si no tiene).\",IF(AX16>D16,\" * La variable Trans Femenino no debe ser mayor al Total Hombre.\",\"\"))","v":""},null,{"$f":"IF(AND($E16<>0,$AN16=\"\"),\"* No olvide escribir en la celda de 'Gestantes' (Digite CERO si no tiene). \",\"\")","v":""},{"$f":"IF(AND($E16<>0,$AO16=\"\"),\"* No olvide escribir en la celda de 'Madres de Hijos menor de 5 años' (Digite CERO si no tiene). \",\"\")","v":""},{"$f":"IF(AND($D16<>0,$AP16=\"\"),\"* No olvide escribir en las celdas de Pueblos Originarios Hombres. (Digite CERO si no tiene).  \",\"\")","v":""},{"$f":"IF(AND($E16<>0,$AQ16=\"\"),\"* No olvide escribir en las celdas de Pueblos Originarios Mujeres (Digite CERO si no tiene).  \",\"\")","v":""},{"$f":"IF(AND($D16<>0,$AR16=\"\"),\"* No olvide escribir en las celdas de Población Migrantes Hombres. (Digite CERO si no tiene). \",\"\")","v":""},{"$f":"IF(AND($E16<>0,$AS16=\"\"),\"* No olvide escribir en las celdas de Población Migrantes Mujeres. (Digite CERO si no tiene). \",\"\")","v":""},"","","",null,null,null,null,0,0,0,0,0,0,0,0,0,null,0,0,null,{"$f":"IF(AND($E16<>0,$AN16=\"\"),1,0)","v":0},{"$f":"IF(AND($E16<>0,$AO16=\"\"),1,0)","v":0},0,null,0,0,0,0,0]
["ABUSO SEXUAL",null,0,0,0,null,null,null,null,null,null,null,null,null,null,null,null,null,null,null,null,null,null,null,null,null,null,null,null,null,null,null,null,null,null,null,null,null,null,null,null,null,null,null,null,null,null,null,null,null,"",null,null,null,null,null,null,null,null,null,null,null,null,null,null,null,null,null,null,null,null,null,null,null,null,null,null,null,null,"","","","","","","","","","","",null,"","","","","","","","","",null,null,null,null,0,0,0,0,0,0,0,0,0,null,0,0,null,0,0,0,null,0,0,0,0,0]
["SUICIDIO","IDEACIÓN",0,{"$f":"+H18+J18+L18+N18+P18+R18+T18+V18+X18+Z18+AB18+AD18+AF18+AH18+AJ18+AL18","v":0},{"$f":"+I18+K18+M18+O18+Q18+S18+U18+W18+Y18+AA18+AC18+AE18+AG18+AI18+AK18+AM18","v":0},null,null,null,null,null,null,null,null,null,null,null,null,null,null,null,null,null,null,null,null,null,null,null,null,null,null,null,null,null,null,null,null,null,null,null,null,null,null,null,null,null,null,null,null,null,"",null,null,null,null,null,null,null,null,null,null,null,null,null,null,null,null,null,null,null,null,null,null,null,null,null,null,null,null,"","","","","","","","","","","",null,"","","","","","","","","",null,null,null,null,0,0,0,0,0,0,0,0,0,null,0,0,null,0,0,0,null,0,0,0,0,0]
[null,"INTENTO",0,{"$f":"+H19+J19+L19+N19+P19+R19+T19+V19+X19+Z19+AB19+AD19+AF19+AH19+AJ19+AL19","v":0},{"$f":"+I19+K19+M19+O19+Q19+S19+U19+W19+Y19+AA19+AC19+AE19+AG19+AI19+AK19+AM19","v":0},null,null,null,null,null,null,null,null,null,null,null,null,null,null,null,null,null,null,null,null,null,null,null,null,null,null,null,null,null,null,null,null,null,null,null,null,null,null,null,null,null,null,null,null,null,"",null,null,null,null,null,null,null,null,null,null,null,null,null,null,null,null,null,null,null,null,null,null,null,null,null,null,null,null,"","","","","","","","","","","",null,"","","","","","","","","",null,null,null,null,0,0,0,0,0,0,0,0,0,null,0,0,null,0,0,0,null,0,0,0,0,0]
["PERSONAS CON DIAGNOSTICOS DE TRASTORNOS MENTALES ",null,0,0,0,null,null,null,null,null,null,null,null,null,null,null,null,null,null,null,null,null,null,null,null,null,null,null,null,null,null,null,null,null,null,null,null,null,null,null,null,null,null,null,null,null,null,null,null,null,"",null,null,null,null,null,null,null,null,null,null,null,null,null,null,null,null,null,null,null,null,null,null,null,null,null,null,null,null,"","","","","","","","","","","",null,"","","","","","",{"$f":"IF(AND($C20<>0,$AT20=\"\"),\"* No olvide escribir en la celda de Niños, Niñas, Adolescentes y Jóvenes SENAME. (Digite CERO si no tiene). \",\"\")","v":""},"","",null,null,null,null,0,0,0,0,0,0,0,0,0,null,0,0,null,0,0,0,null,0,0,0,0,0]
["TRASTORNOS DEL HUMOR\n(AFECTIVOS)","DEPRESIÓN LEVE",{"$f":"SUM(D21:E21)","v":0},0,0,null,null,null,null,null,null,null,null,null,null,null,null,null,null,null,null,null,null,null,null,null,null,null,null,null,null,null,null,null,null,null,null,null,null,null,null,null,null,null,null,null,null,null,null,null,"",null,null,null,null,null,null,null,null,null,null,null,null,null,null,null,null,null,null,null,null,null,null,null,null,null,null,null,null,"","","","","","","","","","","",null,"","","","","","","","","",null,null,null,null,0,0,0,0,0,0,0,0,0,null,0,0,null,0,0,0,null,0,0,0,0,0]
[null,"DEPRESIÓN MODERADA",0,0,0,null,null,null,null,null,null,null,null,null,null,null,null,null,null,null,null,null,null,null,null,null,null,null,null,null,null,null,null,null,null,null,null,null,null,null,null,null,null,null,null,null,null,null,null,null,"",null,null,null,null,null,null,null,null,null,null,null,null,null,null,null,null,null,null,null,null,null,null,null,null,null,null,null,null,"","","","","","","","","","","",null,"","","","","","","","","",null,null,null,null,0,0,0,0,0,0,0,0,0,null,0,0,null,0,0,0,null,0,0,0,0,0]
[null,"DEPRESIÓN GRAVE",0,0,0,null,null,null,null,null,null,null,null,null,null,null,null,null,null,null,null,null,null,null,null,null,null,null,null,null,null,null,null,null,null,null,null,null,null,null,null,null,null,null,null,null,null,null,null,null,"",null,null,null,null,null,null,null,null,null,null,null,null,null,null,null,null,null,null,null,null,null,null,null,null,null,null,null,null,"","","","","","","","","","","",null,"","","","","","","","","",null,null,null,null,0,0,0,0,0,0,0,0,0,null,0,0,null,0,0,0,null,0,0,0,0,0]
[null,"DEPRESIÓN POST PARTO",0,null,{"$f":"K24+M24+O24+Q24+S24+U24+W24+Y24+AA24+AC24","v":0},null,null,null,null,null,null,null,null,null,null,null,null,null,null,null,null,null,null,null,null,null,null,null,null,null,null,null,null,null,null,null,null,null,null,null,null,null,null,null,null,null,null,null,null,null,"",null,null,null,null,null,null,null,null,null,null,null,null,null,null,null,null,null,null,null,null,null,null,null,null,null,null,null,null,null,"",null,"",null,"","","","",{"$f":"IF(AND(E24>0,OR(AW24=\"\")),\" * No olvide digitar la variable Trans Masculino. (Digite Cero si no tiene).\",IF(AW24>E24,\" * La variable Trans Masculino no debe ser mayor al Total Mujeres.\",\"\"))","v":""},null,null,null,"",null,"",null,"","",{"$f":"IF(AND($C24<>0,$AU24=\"\"),\"* No olvide escribir en la celda Niños, Niñas, Adolescentes y Jóvenes Mejor Niñez. (Digite CERO si no tiene). \",\"\")","v":""},"",null,null,null,null,null,0,null,0,null,0,0,0,0,null,0,null,null,null,0,0,null,null,0,0,0,0]
[null,"TRASTORNO BIPOLAR",0,{"$f":"+F25+H25+J25+L25+N25+P25+R25+T25+V25+X25+Z25+AB25+AD25+AF25+AH25+AJ25+AL25","v":0},0,null,null,null,null,null,null,null,null,null,null,null,null,null,null,null,null,null,null,null,null,null,null,null,null,null,null,null,null,null,null,null,null,null,null,null,null,null,null,null,null,null,null,null,null,null,"",null,null,null,null,null,null,null,null,null,null,null,null,null,null,null,null,null,null,null,null,null,null,null,null,null,null,null,null,{"$f":"IF($AN25>$E25,\"* La celda 'Gestantes' debe ser menor o igual al Total de Mujeres en control. \",\"\")","v":""},{"$f":"IF($AO25>$E25,\"* La celda 'Madres de Hijos menor de 5 años' debe ser menor o igual al Total de Mujeres en control. \",\"\")","v":""},{"$f":"IF(($AP25)>$D25,\"* La celda 'Pueblos Originarios / Hombres' debe ser menor o igual al Total de Hombres en control. \",\"\")","v":""},"",{"$f":"IF(($AR25)>$D25,\"* La celda 'Población Migrantes / Hombres' debe ser menor o igual al Total de Hombres en control. \",\"\")","v":""},"","","","",{"$f":"IF(AND(E25>0,OR(AW25=\"\")),\" * No olvide digitar la variable Trans Masculino. (Digite Cero si no tiene).\",IF(AW25>E25,\" * La variable Trans Masculino no debe ser mayor al Total Mujeres.\",\"\"))","v":""},{"$f":"IF(AND(D25>0,OR(AX25=\"\")),\" * No olvide digitar la variable Trans Femenino. (Digite Cero si no tiene).\",IF(AX25>D25,\" * La variable Trans Femenino no debe ser mayor al Total Hombre.\",\"\"))","v":""},null,{"$f":"IF(AND($E25<>0,$AN25=\"\"),\"* No olvide escribir en la celda de 'Gestantes' (Digite CERO si no tiene). \",\"\")","v":""},"","","","","","","","",null,null,null,null,{"$f":"IF($AN25>$E25,1,0)","v":0},0,{"$f":"IF(($AP25)>$D25,1,0)","v":0},0,{"$f":"IF(($AR25)>$D25,1,0)","v":0},0,0,0,0,null,0,{"$f":"IF(AND(D25>0,OR(AX25=\"\")),1,IF((AX25)>D25,1,0))","v":0},null,{"$f":"IF(AND($E25<>0,$AN25=\"\"),1,0)","v":0},0,{"$f":"IF(AND($D25<>0,$AP25=\"\"),1,IF(AND($E25<>0,$AQ25=\"\"),1,0))","v":0},null,{"$f":"IF(AND(D25<>0,AR25=\"\"),1,0)","v":0},0,0,0,0]
["TRASTORNOS MENTALES Y DEL COMPORTAMIENTO DEBIDO A CONSUMO SUSTANCIAS PSICOTROPICAS","CONSUMO PERJUDICIAL DE ALCOHOL ",0,0,0,null,null,null,null,null,null,null,null,null,null,null,null,null,null,null,null,null,null,null,null,null,null,null,null,null,null,null,null,null,null,null,null,null,null,null,null,null,null,null,null,null,null,null,null,null,"",null,null,null,null,null,null,null,null,null,null,null,null,null,null,null,null,null,null,null,null,null,null,null,null,null,null,null,null,{"$f":"IF($AN26>$E26,\"* La celda 'Gestantes' debe ser menor o igual al Total de Mujeres en control. \",\"\")","v":""},{"$f":"IF($AO26>$E26,\"* La celda 'Madres de Hijos menor de 5 años' debe ser menor o igual al Total de Mujeres en control. \",\"\")","v":""},"","","","","","","","","",null,{"$f":"IF(AND($E26<>0,$AN26=\"\"),\"* No olvide escribir en la celda de 'Gestantes' (Digite CERO si no tiene). \",\"\")","v":""},"","","","","","","","",null,null,null,null,{"$f":"IF($AN26>$E26,1,0)","v":0},0,0,0,0,0,0,0,0,null,0,0,null,{"$f":"IF(AND($E26<>0,$AN26=\"\"),1,0)","v":0},0,0,null,0,0,0,0,0]
[null,"CONSUMO DEPENDIENTE DEL ALCOHOL ",0,0,0,null,null,null,null,null,null,null,null,null,null,null,null,null,null,null,null,null,null,null,null,null,null,null,null,null,null,null,null,null,null,null,null,null,null,null,null,null,null,null,null,null,null,null,null,null,"",null,null,null,null,null,null,null,null,null,null,null,null,null,null,null,null,null,null,null,null,null,null,null,null,null,null,null,null,{"$f":"IF($AN27>$E27,\"* La celda 'Gestantes' debe ser menor o igual al Total de Mujeres en control. \",\"\")","v":""},{"$f":"IF($AO27>$E27,\"* La celda 'Madres de Hijos menor de 5 años' debe ser menor o igual al Total de Mujeres en control. \",\"\")","v":""},"","","","","","","","","",null,"","","","","","","","","",null,null,null,null,{"$f":"IF($AN27>$E27,1,0)","v":0},0,0,0,0,0,0,0,0,null,0,0,null,0,0,0,null,0,0,0,0,0]
[null,"CONSUMO PERJUDICIAL DE DROGAS",0,0,0,null,null,null,null,null,null,null,null,null,null,null,null,null,null,null,null,null,null,null,null,null,null,null,null,null,null,null,null,null,null,null,null,null,null,null,null,null,null,null,null,null,null,null,null,null,"",null,null,null,null,null,null,null,null,null,null,null,null,null,null,null,null,null,null,null,null,null,null,null,null,null,null,null,null,null,null,null,null,null,null,null,"","","","",null,"","","","","","","","","",null,null,null,null,null,null,null,null,null,null,null,0,0,null,0,0,null,0,0,0,null,0,0,0,0,0]
[null,"CONSUMO DEPENDIENTE DE DROGAS ",0,0,0,null,null,null,null,null,null,null,null,null,null,null,null,null,null,null,null,null,null,null,null,null,null,null,null,null,null,null,null,null,null,null,null,null,null,null,null,null,null,null,null,null,null,null,null,null,"",null,null,null,null,null,null,null,null,null,null,null,null,null,null,null,null,null,null,null,null,null,null,null,null,null,null,null,null,null,null,null,null,null,null,null,"","","","",null,"","","","","","","","","",null,null,null,null,null,null,null,null,null,null,null,0,0,null,0,0,null,0,0,0,null,0,0,0,0,0]
[null,"CONSUMO DE DROGAS Y ALCOHOL ",0,0,0,null,null,null,null,null,null,null,null,null,null,null,null,null,null,null,null,null,null,null,null,null,null,null,null,null,null,null,null,null,null,null,null,null,null,null,null,null,null,null,null,null,null,null,null,null,"",null,null,null,null,null,null,null,null,null,null,null,null,null,null,null,null,null,null,null,null,null,null,null,null,null,null,null,null,{"$f":"IF($AN30>$E30,\"* La celda 'Gestantes' debe ser menor o igual al Total de Mujeres en control. \",\"\")","v":""},{"$f":"IF($AO30>$E30,\"* La celda 'Madres de Hijos menor de 5 años' debe ser menor o igual al Total de Mujeres en control. \",\"\")","v":""},"","","","","","","","","",null,{"$f":"IF(AND($E30<>0,$AN30=\"\"),\"* No olvide escribir en la celda de 'Gestantes' (Digite CERO si no tiene). \",\"\")","v":""},"","","","","","","","",null,null,null,null,{"$f":"IF($AN30>$E30,1,0)","v":0},0,0,0,0,0,0,0,0,null,0,0,null,0,0,0,null,0,0,0,0,0]
["TRASTORNOS DEL COMPORTAMIENTO Y DE LAS EMOCIONES DE COMIENZO HABITUAL EN LA INFANCIA Y ADOLESCENCIA","TRASTORNO HIPERCINÉTICO",0,0,0,null,null,null,null,null,null,null,null,null,null,null,null,null,null,null,null,null,null,null,null,null,null,null,null,null,null,null,null,null,null,null,null,null,null,null,null,null,null,null,null,null,null,null,null,null,"",null,null,null,null,null,null,null,null,null,null,null,null,null,null,null,null,null,null,null,null,null,null,null,null,null,null,null,null,null,null,"","","","","","","","","",null,null,null,"","","","","","","",null,null,null,null,null,null,0,0,0,0,0,0,0,null,0,0,null,0,null,0,null,0,0,0,0,0]
[null,"TRASTORNO DISOCIAL DESAFIANTE Y OPOSICIONISTA",0,0,0,null,null,null,null,null,null,null,null,null,null,null,null,null,null,null,null,null,null,null,null,null,null,null,null,null,null,null,null,null,null,null,null,null,null,null,null,null,null,null,null,null,null,null,null,null,"",null,null,null,null,null,null,null,null,null,null,null,null,null,null,null,null,null,null,null,null,null,null,null,null,null,null,null,null,null,null,"","","","","","","","","",null,null,null,"","","","","","","",null,null,null,null,null,null,0,0,0,0,0,0,0,null,0,0,null,0,null,0,null,0,0,0,0,0]
[null,"TRASTORNO DE ANSIEDAD DE SEPARACIÓN EN LA INFANCIA",0,{"$f":"+F33+H33+J33","v":0},{"$f":"+G33+I33+K33","v":0},null,null,null,null,null,null,null,null,null,null,null,null,null,null,null,null,null,null,null,null,null,null,null,null,null,null,null,null,null,null,null,null,null,null,null,null,null,null,null,null,null,null,null,null,null,"",null,null,null,null,null,null,null,null,null,null,null,null,null,null,null,null,null,null,null,null,null,null,null,null,null,null,null,null,null,null,"","","","","","","","","",null,null,null,"","","","","","","",null,null,null,null,null,null,0,0,0,0,0,0,0,null,0,0,null,0,null,0,null,0,0,0,0,0]
[null,"OTROS TRASTORNOS DEL COMPORTAMIENTO Y DE LAS EMOCIONES DE COMIENZO HABITUAL EN LA INFANCIA Y ADOLESCENCIA",0,{"$f":"+F34+H34+J34+L34+N34","v":0},{"$f":"+G34+I34+K34+M34+O34","v":0},null,null,null,null,null,null,null,null,null,null,null,null,null,null,null,null,null,null,null,null,null,null,null,null,null,null,null,null,null,null,null,null,null,null,null,null,null,null,null,null,null,null,null,null,null,"",null,null,null,null,null,null,null,null,null,null,null,null,null,null,null,null,null,null,null,null,null,null,null,null,null,null,null,null,null,null,"","","","","","","","","",null,null,null,"","","","","","",{"$f":"IF(AND($C34<>0,$AV34=\"\"),\"* No olvide escribir en la celda Plan Cuidado integral Elaborado. (Digite CERO si no tiene). \",\"\")","v":""},null,null,null,null,null,null,0,0,0,0,0,0,0,null,0,0,null,0,null,0,null,0,0,0,0,0]
["TRASTORNOS DE ANSIEDAD","TRASTORNO DE ESTRÉS POST TRAUMATICO",0,{"$f":"SUM(F35+H35+J35+L35+N35+P35+R35+T35+V35+X35+Z35+AB35+AD35+AF35+AH35+AJ35+AL35)","v":0},{"$f":"SUM(G35+I35+K35+M35+O35+Q35+S35+U35+W35+Y35+AA35+AC35+AE35+AG35+AI35+AK35+AM35)","v":0},null,null,null,null,null,null,null,null,null,null,null,null,null,null,null,null,null,null,null,null,null,null,null,null,null,null,null,null,null,null,null,null,null,null,null,null,null,null,null,null,null,null,null,null,null,"",null,null,null,null,null,null,null,null,null,null,null,null,null,null,null,null,null,null,null,null,null,null,null,null,null,null,null,null,{"$f":"IF($AN35>$E35,\"* La celda 'Gestantes' debe ser menor o igual al Total de Mujeres en control. \",\"\")","v":""},{"$f":"IF($AO35>$E35,\"* La celda 'Madres de Hijos menor de 5 años' debe ser menor o igual al Total de Mujeres en control. \",\"\")","v":""},"","","","","","","","","",null,{"$f":"IF(AND($E35<>0,$AN35=\"\"),\"* No olvide escribir en la celda de 'Gestantes' (Digite CERO si no tiene). \",\"\")","v":""},{"$f":"IF(AND($E35<>0,$AO35=\"\"),\"* No olvide escribir en la celda de 'Madres de Hijos menor de 5 años' (Digite CERO si no tiene). \",\"\")","v":""},"","","","","","","",null,null,null,null,{"$f":"IF($AN35>$E35,1,0)","v":0},{"$f":"IF($AO35>$E35,1,0)","v":0},0,0,0,0,0,0,0,null,0,0,null,{"$f":"IF(AND($E35<>0,$AN35=\"\"),1,0)","v":0},{"$f":"IF(AND($E35<>0,$AO35=\"\"),1,0)","v":0},0,null,0,0,0,0,0]
[null,"TRASTORNO DE PÁNICO",0,0,{"$f":"SUM(G36+I36+K36+M36+O36+Q36+S36+U36+W36+Y36+AA36+AC36+AE36+AG36+AI36+AK36+AM36)","v":0},null,null,null,null,null,null,null,null,null,null,null,null,null,null,null,null,null,null,null,null,null,null,null,null,null,null,null,null,null,null,null,null,null,null,null,null,null,null,null,null,null,null,null,null,null,"",null,null,null,null,null,null,null,null,null,null,null,null,null,null,null,null,null,null,null,null,null,null,null,null,null,null,null,null,null,null,null,null,null,null,null,"","","","",null,{"$f":"IF(AND($E36<>0,$AN36=\"\"),\"* No olvide escribir en la celda de 'Gestantes' (Digite CERO si no tiene). \",\"\")","v":""},{"$f":"IF(AND($E36<>0,$AO36=\"\"),\"* No olvide escribir en la celda de 'Madres de Hijos menor de 5 años' (Digite CERO si no tiene). \",\"\")","v":""},"","","","","","","",null,null,null,null,null,null,null,null,null,null,null,0,0,null,0,0,null,{"$f":"IF(AND($E36<>0,$AN36=\"\"),1,0)","v":0},{"$f":"IF(AND($E36<>0,$AO36=\"\"),1,0)","v":0},0,null,{"$f":"IF(AND(D36<>0,AR36=\"\"),1,0)","v":0},{"$f":"IF(AND(E36<>0,AS36=\"\"),1,0)","v":0},{"$f":"IF(AND($C36<>0,AT36=\"\"),1,0)","v":0},0,0]
[null,"FOBIAS SOCIALES",0,{"$f":"SUM(F37+H37+J37+L37+N37+P37+R37+T37+V37+X37+Z37+AB37+AD37+AF37+AH37+AJ37+AL37)","v":0},0,null,null,null,null,null,null,null,null,null,null,null,null,null,null,null,null,null,null,null,null,null,null,null,null,null,null,null,null,null,null,null,null,null,null,null,null,null,null,null,null,null,null,null,null,null,"",null,null,null,null,null,null,null,null,null,null,null,null,null,null,null,null,null,null,null,null,null,null,null,null,null,null,null,null,"","","","","","","","","","","",null,{"$f":"IF(AND($E37<>0,$AN37=\"\"),\"* No olvide escribir en la celda de 'Gestantes' (Digite CERO si no tiene). \",\"\")","v":""},{"$f":"IF(AND($E37<>0,$AO37=\"\"),\"* No olvide escribir en la celda de 'Madres de Hijos menor de 5 años' (Digite CERO si no tiene). \",\"\")","v":""},"","","","","","","",null,null,null,null,0,0,0,0,0,0,0,0,0,null,0,0,null,{"$f":"IF(AND($E37<>0,$AN37=\"\"),1,0)","v":0},{"$f":"IF(AND($E37<>0,$AO37=\"\"),1,0)","v":0},0,null,{"$f":"IF(AND(D37<>0,AR37=\"\"),1,0)","v":0},0,0,0,0]
[null,"TRASTORNOS DE ANSIEDAD GENERALIZADA",0,0,0,null,null,null,null,null,null,null,null,null,null,null,null,null,null,null,null,null,null,null,null,null,null,null,null,null,null,null,null,null,null,null,null,null,null,null,null,null,null,null,null,null,null,null,null,null,"",null,null,null,null,null,null,null,null,null,null,null,null,null,null,null,null,null,null,null,null,null,null,null,null,null,null,null,null,"","","","","","","","","","","",null,"","","","","","","","","",null,null,null,null,0,0,0,0,0,0,0,0,0,null,0,0,null,0,{"$f":"IF(AND($E38<>0,$AO38=\"\"),1,0)","v":0},0,null,0,0,0,0,0]
[null,"OTROS TRASTORNOS DE ANSIEDAD",0,0,0,null,null,null,null,null,null,null,null,null,null,null,null,null,null,null,null,null,null,null,null,null,null,null,null,null,null,null,null,null,null,null,null,null,null,null,null,null,null,null,null,null,null,null,null,null,"",null,null,null,null,null,null,null,null,null,null,null,null,null,null,null,null,null,null,null,null,null,null,null,null,null,null,null,null,"","","","","","","","",{"$f":"IF($AV39>$C39,\"* La celda 'Plan Cuidado Integral Elaborado' debe ser menor o igual al Total de Personas en control. \",\"\")","v":""},"","",null,"","","","","","","","","",null,null,null,null,0,0,0,0,0,0,0,0,0,null,0,0,null,0,0,0,null,0,0,0,0,0]
["DEMENCIAS (INCLUYE ALZHEIMER)","LEVE",0,{"$f":"+F40+H40+J40+L40+N40+P40+R40+T40+V40+X40+Z40+AB40+AD40+AF40+AH40+AJ40+AL40","v":0},{"$f":"+G40+I40+K40+M40+O40+Q40+S40+U40+W40+Y40+AA40+AC40+AE40+AG40+AI40+AK40+AM40","v":0},null,null,null,null,null,null,null,null,null,null,null,null,null,null,null,null,null,null,null,null,null,null,null,null,null,null,null,null,null,null,null,null,null,null,null,null,null,null,null,null,null,null,null,null,null,"",null,null,null,null,null,null,null,null,null,null,null,null,null,null,null,null,null,null,null,null,null,null,null,null,null,null,null,null,"","","","","","","","","","","",null,"","","","","","","","","",null,null,null,null,0,0,0,0,0,0,0,0,0,null,0,0,null,null,null,0,null,0,0,0,0,0]
[null,"MODERADO",0,0,0,null,null,null,null,null,null,null,null,null,null,null,null,null,null,null,null,null,null,null,null,null,null,null,null,null,null,null,null,null,null,null,null,null,null,null,null,null,null,null,null,null,null,null,null,null,"",null,null,null,null,null,null,null,null,null,null,null,null,null,null,null,null,null,null,null,null,null,null,null,null,null,null,null,null,"","","","","","","","","","","",null,"","","","","","","","","",null,null,null,null,0,0,0,0,0,0,0,0,0,null,0,0,null,null,null,0,null,0,0,0,0,0]
[null,"AVANZADO",0,0,0,null,null,null,null,null,null,null,null,null,null,null,null,null,null,null,null,null,null,null,null,null,null,null,null,null,null,null,null,null,null,null,null,null,null,null,null,null,null,null,null,null,null,null,null,null,"",null,null,null,null,null,null,null,null,null,null,null,null,null,null,null,null,null,null,null,null,null,null,null,null,null,null,null,null,"","","","","","","","","","","",null,"","","","","","","","","",null,null,null,null,0,0,0,0,0,0,0,0,0,null,0,0,null,null,null,0,null,0,0,0,0,0]
["ESQUIZOFRENIA",null,0,0,0,null,null,null,null,null,null,null,null,null,null,null,null,null,null,null,null,null,null,null,null,null,null,null,null,null,null,null,null,null,null,null,null,null,null,null,null,null,null,null,null,null,null,null,null,null,"",null,null,null,null,null,null,null,null,null,null,null,null,null,null,null,null,null,null,null,null,null,null,null,null,null,null,null,null,"","","","","","","","","","","",null,"","","","","","","","","",null,null,null,null,0,0,0,0,0,0,0,0,0,null,0,0,null,0,{"$f":"IF(AND($E43<>0,$AO43=\"\"),1,0)","v":0},0,null,0,0,0,0,0]
["TRASTORNO ADAPTATIVO",null,0,0,0,null,null,null,null,null,null,null,null,null,null,null,null,null,null,null,null,null,null,null,null,null,null,null,null,null,null,null,null,null,null,null,null,null,null,null,null,null,null,null,null,null,null,null,null,null,"",null,null,null,null,null,null,null,null,null,null,null,null,null,null,null,null,null,null,null,null,null,null,null,null,null,null,null,null,null,null,null,null,null,null,null,"","","","",null,"","","","","","","","","",null,null,null,null,0,0,0,0,0,0,0,0,0,null,0,0,null,0,{"$f":"IF(AND($E44<>0,$AO44=\"\"),1,0)","v":0},0,null,{"$f":"IF(AND(D44<>0,AR44=\"\"),1,0)","v":0},{"$f":"IF(AND(E44<>0,AS44=\"\"),1,0)","v":0},{"$f":"IF(AND($C44<>0,AT44=\"\"),1,0)","v":0},{"$f":"IF(AND($C44<>0,AU44=\"\"),1,0)","v":0},0]
["TRASTORNOS DE LA CONDUCTA ALIMENTARIA",null,0,0,0,null,null,null,null,null,null,null,null,null,null,null,null,null,null,null,null,null,null,null,null,null,null,null,null,null,null,null,null,null,null,null,null,null,null,null,null,null,null,null,null,null,null,null,null,null,"",null,null,null,null,null,null,null,null,null,null,null,null,null,null,null,null,null,null,null,null,null,null,null,null,null,null,null,null,"","","","","","","","","","","",null,"","","","","","","","","",null,null,null,null,0,0,0,0,0,0,0,0,0,null,0,0,null,0,{"$f":"IF(AND($E45<>0,$AO45=\"\"),1,0)","v":0},0,null,{"$f":"IF(AND(D45<>0,AR45=\"\"),1,0)","v":0},0,0,0,0]
["RETRASO MENTAL",null,0,0,0,null,null,null,null,null,null,null,null,null,null,null,null,null,null,null,null,null,null,null,null,null,null,null,null,null,null,null,null,null,null,null,null,null,null,null,null,null,null,null,null,null,null,null,null,null,"",null,null,null,null,null,null,null,null,null,null,null,null,null,null,null,null,null,null,null,null,null,null,null,null,null,null,null,null,"","","","","","","","","","","",null,"","","","","","","","","",null,null,null,null,0,0,0,0,0,0,0,0,0,null,0,0,null,0,{"$f":"IF(AND($E46<>0,$AO46=\"\"),1,0)","v":0},0,null,{"$f":"IF(AND(D46<>0,AR46=\"\"),1,0)","v":0},0,0,0,0]
["TRASTORNO DE PERSONALIDAD",null,0,0,0,null,null,null,null,null,null,null,null,null,null,null,null,null,null,null,null,null,null,null,null,null,null,null,null,null,null,null,null,null,null,null,null,null,null,null,null,null,null,null,null,null,null,null,null,null,"",null,null,null,null,null,null,null,null,null,null,null,null,null,null,null,null,null,null,null,null,null,null,null,null,null,null,null,null,"","","","","","","","","","","",null,"","","","","","","","","",null,null,null,null,0,0,0,0,0,0,0,0,0,null,0,0,null,0,0,0,null,{"$f":"IF(AND(D47<>0,AR47=\"\"),1,0)","v":0},0,0,0,0]
["TRASTORNO GENERALIZADOS DEL DESARROLLO","AUTISMO",{"$f":"SUM(D48:E48)","v":0},{"$f":"+F48+H48+J48+L48+N48+P48+R48+T48+V48+X48+Z48+AB48+AD48+AF48+AH48+AJ48+AL48","v":0},{"$f":"+G48+I48+K48+M48+O48+Q48+S48+U48+W48+Y48+AA48+AC48+AE48+AG48+AI48+AK48+AM48","v":0},null,null,null,null,null,null,null,null,null,null,null,null,null,null,null,null,null,null,null,null,null,null,null,null,null,null,null,null,null,null,null,null,null,null,null,null,null,null,null,null,null,null,null,null,null,"",null,null,null,null,null,null,null,null,null,null,null,null,null,null,null,null,null,null,null,null,null,null,null,null,null,null,null,null,null,null,null,null,null,null,null,"","","","",null,"","","","","","","","","",null,null,null,null,0,0,0,0,0,0,0,0,0,null,0,0,null,0,0,0,null,{"$f":"IF(AND(D48<>0,AR48=\"\"),1,0)","v":0},{"$f":"IF(AND(E48<>0,AS48=\"\"),1,0)","v":0},{"$f":"IF(AND($C48<>0,AT48=\"\"),1,0)","v":0},0,0]
[null,"ASPERGER",0,{"$f":"+F49+H49+J49+L49+N49+P49+R49+T49+V49+X49+Z49+AB49+AD49+AF49+AH49+AJ49+AL49","v":0},{"$f":"+G49+I49+K49+M49+O49+Q49+S49+U49+W49+Y49+AA49+AC49+AE49+AG49+AI49+AK49+AM49","v":0},null,null,null,null,null,null,null,null,null,null,null,null,null,null,null,null,null,null,null,null,null,null,null,null,null,null,null,null,null,null,null,null,null,null,null,null,null,null,null,null,null,null,null,null,null,"",null,null,null,null,null,null,null,null,null,null,null,null,null,null,null,null,null,null,null,null,null,null,null,null,null,null,null,null,null,null,null,null,null,null,null,"","",{"$f":"IF(AND(E49>0,OR(AW49=\"\")),\" * No olvide digitar la variable Trans Masculino. (Digite Cero si no tiene).\",IF(AW49>E49,\" * La variable Trans Masculino no debe ser mayor al Total Mujeres.\",\"\"))","v":""},"",null,"","","","","","","","","",null,null,null,null,0,0,0,0,0,0,0,0,0,null,0,0,null,0,0,0,null,0,0,0,0,0]
[null,"SÍNDROME DE RETT",0,0,0,null,null,null,null,null,null,null,null,null,null,null,null,null,null,null,null,null,null,null,null,null,null,null,null,null,null,null,null,null,null,null,null,null,null,null,null,null,null,null,null,null,null,null,null,null,"",null,null,null,null,null,null,null,null,null,null,null,null,null,null,null,null,null,null,null,null,null,null,null,null,null,null,null,null,null,null,null,null,null,null,null,"","","","",null,"","","","","","","","","",null,null,null,null,0,0,0,0,0,0,0,0,0,null,0,0,null,0,0,0,null,0,0,0,0,0]
[null,"TRASTORNO DESINTEGRATIVO DE LA INFANCIA",0,0,0,null,null,null,null,null,null,null,null,null,null,null,null,null,null,null,null,null,null,null,null,null,null,null,null,null,null,null,null,null,null,null,null,null,null,null,null,null,null,null,null,null,null,null,null,null,"",null,null,null,null,null,null,null,null,null,null,null,null,null,null,null,null,null,null,null,null,null,null,null,null,null,null,null,null,null,null,null,null,null,null,null,"","","","",null,"","","","","","","","","",null,null,null,null,0,0,0,0,0,0,0,0,0,null,0,0,null,0,0,0,null,0,0,0,0,0]
[null,"TRASTONO GENERALIZADO DEL DESARROLLO NO ESPECÍFICO",0,0,0,null,null,null,null,null,null,null,null,null,null,null,null,null,null,null,null,null,null,null,null,null,null,null,null,null,null,null,null,null,null,null,null,null,null,null,null,null,null,null,null,null,null,null,null,null,"",null,null,null,null,null,null,null,null,null,null,null,null,null,null,null,null,null,null,null,null,null,null,null,null,null,null,null,null,"","","","","","","","","","","",null,"","","","","","","","","",null,null,null,null,0,0,0,0,0,0,0,0,0,null,0,0,null,0,{"$f":"IF(AND($E52<>0,$AO52=\"\"),1,0)","v":0},0,null,{"$f":"IF(AND(D52<>0,AR52=\"\"),1,0)","v":0},0,0,0,0]
["EPILEPSIA",null,{"$f":"SUM(D53:E53)","v":0},0,0,null,null,null,null,null,null,null,null,null,null,null,null,null,null,null,null,null,null,null,null,null,null,null,null,null,null,null,null,null,null,null,null,null,null,null,null,null,null,null,null,null,null,null,null,null,"",null,null,null,null,null,null,null,null,null,null,null,null,null,null,null,null,null,null,null,null,null,null,null,null,null,null,null,null,"","","","","","","","","","","",null,{"$f":"IF(AND($E53<>0,$AN53=\"\"),\"* No olvide escribir en la celda de 'Gestantes' (Digite CERO si no tiene). \",\"\")","v":""},{"$f":"IF(AND($E53<>0,$AO53=\"\"),\"* No olvide escribir en la celda de 'Madres de Hijos menor de 5 años' (Digite CERO si no tiene). \",\"\")","v":""},"","","","","","","",null,null,null,null,0,0,0,0,0,0,0,0,0,null,0,0,null,0,{"$f":"IF(AND($E53<>0,$AO53=\"\"),1,0)","v":0},0,null,{"$f":"IF(AND(D53<>0,AR53=\"\"),1,0)","v":0},0,0,0,0]
["OTRAS ",null,{"$f":"SUM(D54:E54)","v":0},0,0,null,null,null,null,null,null,null,null,null,null,null,null,null,null,null,null,null,null,null,null,null,null,null,null,null,null,null,null,null,null,null,null,null,null,null,null,null,null,null,null,null,null,null,null,null,"",null,null,null,null,null,null,null,null,null,null,null,null,null,null,null,null,null,null,null,null,null,null,null,null,null,null,null,null,{"$f":"IF($AN54>$E54,\"* La celda 'Gestantes' debe ser menor o igual al Total de Mujeres en control. \",\"\")","v":""},"","","","","","","","","","",null,{"$f":"IF(AND($E54<>0,$AN54=\"\"),\"* No olvide escribir en la celda de 'Gestantes' (Digite CERO si no tiene). \",\"\")","v":""},{"$f":"IF(AND($E54<>0,$AO54=\"\"),\"* No olvide escribir en la celda de 'Madres de Hijos menor de 5 años' (Digite CERO si no tiene). \",\"\")","v":""},"","","","","","","",null,null,null,null,0,{"$f":"IF($AO54>$E54,1,0)","v":0},0,0,0,0,0,0,0,null,0,0,null,0,{"$f":"IF(AND($E54<>0,$AO54=\"\"),1,0)","v":0},{"$f":"IF(AND($D54<>0,$AP54=\"\"),1,IF(AND($E54<>0,$AQ54=\"\"),1,0))","v":0},null,{"$f":"IF(AND(D54<>0,AR54=\"\"),1,0)","v":0},0,0,0,0]
["SECCION A.2: PROGRAMA DE REHABILITACIÓN EN ATENCION PRIMARIA (PERSONAS CON TRANSTORNOS PSIQUIÁTRICO)."]
["TIPO","RUBRO","T O T A L",null,null,"GRUPO DE EDAD (en años)"]
[null,null,null,null,null,"0 a 4 años",null,"5 a 9 años",null,"10 a 14 años",null,"15 a 19 años",null,"20 a 24 años",null,"25 a 29 años",null,"30 a 34 años",null,"35 a 39 años",null,"40 a 44 años",null,"45 a 49 años",null,"50 a 54 años",null,"55 a 59 años",null,"60 a 64 años",null,"65 a 69 años",null,"70 a 74 años",null,"75 a 79 años",null,"80 y más años"]
[null,null,"Ambos\nsexos","Hombres","Mujeres","Hombres","Mujeres","Hombres","Mujeres","Hombres","Mujeres","Hombres","Mujeres","Hombres","Mujeres","Hombres","Mujeres","Hombres","Mujeres","Hombres","Mujeres","Hombres","Mujeres","Hombres","Mujeres","Hombres","Mujeres","Hombres","Mujeres","Hombres","Mujeres","Hombres","Mujeres","Hombres","Mujeres","Hombres","Mujeres","Hombres","Mujeres"]
["PROGRAMA DE REHABILITACIÓN TIPO I","NÚMERO DE PERSONAS EN CONTROL EN EL PROGRAMA",{"$f":"SUM(D59:E59)","v":0},{"$f":"+F59+H59+J59+L59+N59+P59+R59+T59+V59+X59+Z59+AB59+AD59+AF59+AH59+AJ59+AL59","v":0},{"$f":"+G59+I59+K59+M59+O59+Q59+S59+U59+W59+Y59+AA59+AC59+AE59+AG59+AI59+AK59+AM59","v":0}]
["PROGRAMA DE REHABILITACIÓN TIPO II","NÚMERO DE PERSONAS EN CONTROL EN EL PROGRAMA",{"$f":"SUM(D60:E60)","v":0},{"$f":"+F60+H60+J60+L60+N60+P60+R60+T60+V60+X60+Z60+AB60+AD60+AF60+AH60+AJ60+AL60","v":0},{"$f":"+G60+I60+K60+M60+O60+Q60+S60+U60+W60+Y60+AA60+AC60+AE60+AG60+AI60+AK60+AM60","v":0}]
["SECCION A.3: PROGRAMA DE ACOMPAÑAMIENTO PSICOSOCIAL EN LA ATENCION PRIMARIA"]
["CONCEPTO",null,"TOTAL",null,null,"GRUPOS DE EDAD (en años)",null,null,null,null,null,null,null,null,null,"Población Migrantes"]
[null,null,null,null,null,"0 a 4 años",null,"5 a 9 años",null,"10 a 14 años",null,"15 a 19 años",null,"20 a 24 años"]
[null,null,"Ambos Sexos","Hombres","Mujeres","Hombres","Mujeres","Hombres","Mujeres","Hombres","Mujeres","Hombres","Mujeres","Hombres","Mujeres","Hombres","Mujeres"]
["N° DE PERSONAS EN CONTROL EN PROGRAMA DE ACOMPAÑAMIENTO PSICOSOCIAL",null,{"$f":"SUM(D65:E65)","v":0},{"$f":"+F65+H65+J65+L65+N65","v":0},{"$f":"+G65+I65+K65+M65+O65","v":0},null,null,null,null,null,null,null,null,null,null,null,null,{"$f":"CA65&CB65&CC65&CD65&CE65&CF65&CG65&CH65&CI65&CJ65&CK65&CL65&CM65&CN65&CO65&CP65&CQ65&CS65&CT65&CU65&CV65&CW65&CX65","v":""},null,null,null,null,null,null,null,null,null,null,null,null,null,null,null,null,null,null,null,null,null,null,null,null,null,null,null,null,null,null,null,null,null,null,null,null,null,null,null,null,null,null,null,null,null,null,null,null,null,null,null,null,null,null,null,null,null,null,null,null,null,null,null,null,null,{"$f":"IF(AND(D65>0,OR(P65=\"\")),\" * No olvide digitar la variable Población Migrantes Hombres (Digite Cero si no tiene).\",IF(P65>D65,\" * La variable Población Migrantes Hombres no debe ser mayor al Total Hombres.\",\"\"))","v":""},{"$f":"IF(AND(E65>0,OR(Q65=\"\")),\" * No olvide digitar la variable Población Migrantes Mujeres (Digite Cero si no tiene).\",IF(Q65>E65,\" * La variable Población Migrantes Mujeres no debe ser mayor al Total Mujeres.\",\"\"))","v":""},null,null,null,null,null,null,null,null,null,null,null,null,null,null,null,null,null,null,null,null,null,null,null,{"$f":"IF(($P65)>$D65,1,0)","v":0},{"$f":"IF($Q65>$E65,1,0)","v":0},{"$f":"IF(AND($D65<>0,$P65=\"\"),1,0)","v":0},{"$f":"IF(AND($E65<>0,$Q65=\"\"),1,0)","v":0}]
["B. ATENCIÓN DE ESPECIALIDADES\nSECCION B.1: POBLACIÓN EN CONTROL EN ESPECIALIDAD AL CORTE"]
["CONCEPTO",null,"T O T A L",null,null,"GRUPO DE EDAD (en años)",null,null,null,null,null,null,null,null,null,null,null,null,null,null,null,null,null,null,null,null,null,null,null,null,null,null,null,null,null,null,null,null,null,"Gestantes","Madre de Hijo menor de 5 años ","Pueblos Originarios",null," Migrantes",null,"Niños, Niñas, Adolescentes y Jóvenes SENAME","Niños, Niñas, Adolescentes y Jóvenes Mejor Niñez","Plan Cuidado Integral Elaborado","TRANS "]
[null,null,null,null,null,"0 a 4 años",null,"5 a 9 años",null,"10 a 14 años",null,"15 a 19 años",null,"20 a 24 años",null,"25 a 29 años",null,"30 a 34 años",null,"35 a 39 años",null,"40 a 44 años",null,"45 a 49 años",null,"50 a 54 años",null,"55 a 59 años",null,"60 a 64 años",null,"65 a 69 años",null,"70 a 74 años",null,"75 a 79 años",null,"80 y más años",null,null,null,null,null,null,null,null,null,null,null,null,null,null,null,null,null,null,null,null,null,null,null,null,null,null,null,null,null,null,null,null,null,null,null,null,null,null,null,null,null,"Gestantes","Madre de hijos","Pueblos originarios","Pueblos originarios","Poblacion Migrantes","Poblacion Migrantes","Población SENAME","Población Mejor Niñez","Plan Cuidado Integral Elaborado","Trans","Trans",null,"Gestantes","Madre de hijos","Pueblos originarios","Pueblos originarios","Poblacion Migrantes","Poblacion Migrantes","Población SENAME","Población Mejor Niñez","PCIE",null,null,null,null,"Gestantes","Madre de hijos","Pueblos originarios","Pueblos originarios","Poblacion Migrantes","Poblacion Migrantes","Niños y niñas SENAME","Niños y niñas Mejor Niñez","Plan Cuidado Integral Elaborado",null,"Trans","Trans",null,"Gestantes","Madre de hijos","Pueblos originarios","Pueblos originarios","Poblacion Migrantes","Poblacion Migrantes","Niños y niñas SENAME","Niños y niñas Mejor Niñez","Plan Cuidado Integral Elaborado"]
[null,null,"Ambos\nsexos","Hombres","Mujeres","Hombres","Mujeres","Hombres","Mujeres","Hombres","Mujeres","Hombres","Mujeres","Hombres","Mujeres","Hombres","Mujeres","Hombres","Mujeres","Hombres","Mujeres","Hombres","Mujeres","Hombres","Mujeres","Hombres","Mujeres","Hombres","Mujeres","Hombres","Mujeres","Hombres ","Mujeres","Hombres ","Mujeres","Hombres ","Mujeres","Hombres","Mujeres",null,null,"Hombres","Mujeres","Hombres","Mujeres",null,null,null,"Masculino","Femenino ",null,null,null,null,null,null,null,null,null,null,null,null,null,null,null,null,null,null,null,null,null,null,null,null,null,null,null,null,null,null,null,"Hombres","Mujeres","Hombres","Mujeres",null,null,null,"Masculino","Femenino",null,"No Olvide","No Olvide","Hombres","Mujeres","Hombres","Mujeres","No Olvide","No Olvide","No Olvide",null,null,null,null,null,null,"Hombres","Mujeres","Hombres","Mujeres",null,null,null,null,"Masculino","Femenino",null,"No Olvide","No Olvide","Hombres","Mujeres","Hombres","Mujeres"]
["NUMERO DE PERSONAS EN CONTROL EN EL PROGRAMA",null,{"$f":"SUM(D70:E70)","v":0},{"$f":"+F70+H70+J70+L70+N70+P70+R70+T70+V70+X70+Z70+AB70+AD70+AF70+AH70+AJ70+AL70","v":0},{"$f":"+G70+I70+K70+M70+O70+Q70+S70+U70+W70+Y70+AA70+AC70+AE70+AG70+AI70+AK70+AM70","v":0},null,null,null,null,null,null,null,null,null,null,null,null,null,null,null,null,null,null,null,null,null,null,null,null,null,null,null,null,null,null,null,null,null,null,null,null,null,null,null,null,null,null,null,null,null,{"$f":"$CB70&CC70&CD70&CE70&CF70&CG70&CH70&CI70&CJ70&CK70&CL70&CN70&CO70&CP70&CQ70&CR70&CS70&CT70&CU70&CV70","v":""},null,null,null,null,null,null,null,null,null,null,null,null,null,null,null,null,null,null,null,null,null,null,null,null,null,null,null,null,{"$f":"IF($AN70>$E70,\"* La celda 'Gestantes' debe ser menor o igual al Total de Mujeres en control. \",\"\")","v":""},{"$f":"IF($AO70>$E70,\"* La celda 'Madres de Hijos menor de 5 años' debe ser menor o igual al Total de Mujeres en control. \",\"\")","v":""},{"$f":"IF(($AP70)>$D70,\"* La celda 'Pueblos Originarios / Hombres' debe ser menor o igual al Total de Hombres en control. \",\"\")","v":""},{"$f":"IF($AQ70>$E70,\"* La celda 'Pueblos Originarios / Mujeres' debe ser menor o igual al Total de Mujeres en control. \",\"\")","v":""},{"$f":"IF(($AR70)>$D70,\"* La celda 'Población Migrantes / Hombres' debe ser menor o igual al Total de Hombres en control. \",\"\")","v":""},{"$f":"IF($AS70>$E70,\"* La celda 'Población Migrantes / Mujeres' debe ser menor o igual al Total de Mujeres en control. \",\"\")","v":""},{"$f":"IF($AT70>$C70,\"* La celda 'Niños, Niñas, Adolescentes y Jóvenes de Población SENAME' debe ser menor o igual al Total de Ambos Sexos. \",\"\")","v":""},{"$f":"IF($AU70>$C70,\"* La celda 'Niños, Niñas, Adolescentes y Jóvenes Mejor Niñez' debe ser menor o igual al Total de Ambos Sexos. \",\"\")","v":""},{"$f":"IF($AV70>$C70,\"* La celda 'Plan Cuidado Integral Elaborado' debe ser menor o igual al Total de Personas en control. \",\"\")","v":""},{"$f":"IF(AND(E70>0,OR(AW70=\"\")),\" * No olvide digitar la variable Trans Masculino. (Digite Cero si no tiene).\",IF(AW70>E70,\" * La variable Trans Masculino no debe ser mayor al Total Mujeres.\",\"\"))","v":""},{"$f":"IF(AND(D70>0,OR(AX70=\"\")),\" * No olvide digitar la variable Trans Femenino. (Digite Cero si no tiene).\",IF(AX70>D70,\" * La variable Trans Femenino no debe ser mayor al Total Hombre.\",\"\"))","v":""},null,{"$f":"IF(AND($E70<>0,$AN70=\"\"),\"* No olvide escribir en la celda de 'Gestantes' (Digite CERO si no tiene). \",\"\")","v":""},{"$f":"IF(AND($E70<>0,$AO70=\"\"),\"* No olvide escribir en la celda de 'Madres de Hijos menor de 5 años' (Digite CERO si no tiene). \",\"\")","v":""},{"$f":"IF(AND($D70<>0,$AP70=\"\"),\"* No olvide escribir en las celdas de Pueblos Originarios Hombres. (Digite CERO si no tiene).  \",\"\")","v":""},{"$f":"IF(AND($E70<>0,$AQ70=\"\"),\"* No olvide escribir en las celdas de Pueblos Originarios Mujeres (Digite CERO si no tiene).  \",\"\")","v":""},{"$f":"IF(AND($D70<>0,$AR70=\"\"),\"* No olvide escribir en las celdas de Población Migrantes Hombres. (Digite CERO si no tiene). \",\"\")","v":""},{"$f":"IF(AND($E70<>0,$AS70=\"\"),\"* No olvide escribir en las celdas de Población Migrantes Mujeres. (Digite CERO si no tiene). \",\"\")","v":""},{"$f":"IF(AND($C70<>0,$AT70=\"\"),\"* No olvide escribir en la celda de Niños, Niñas, Adolescentes y Jóvenes SENAME. (Digite CERO si no tiene). \",\"\")","v":""},{"$f":"IF(AND($C70<>0,$AU70=\"\"),\"* No olvide escribir en la celda Niños, Niñas, Adolescentes y Jóvenes Mejor Niñez. (Digite CERO si no tiene). \",\"\")","v":""},{"$f":"IF(AND($C70<>0,$AV70=\"\"),\"* No olvide escribir en la celda Plan Cuidado integral Elaborado. (Digite CERO si no tiene). \",\"\")","v":""},null,null,null,null,{"$f":"IF($AN70>$E70,1,0)","v":0},{"$f":"IF($AO70>$E70,1,0)","v":0},{"$f":"IF(($AP70)>$D70,1,0)","v":0},{"$f":"IF($AQ70>$E70,1,0)","v":0},{"$f":"IF(($AR70)>$D70,1,0)","v":0},{"$f":"IF($AS70>$E70,1,0)","v":0},{"$f":"IF($AT70>$C70,1,0)","v":0},{"$f":"IF($AU70>$C70,1,0)","v":0},{"$f":"IF($AV70>$C70,1,0)","v":0},null,{"$f":"IF(AND(E70>0,OR(AW70=\"\")),1,IF((AW70)>E70,1,0))","v":0},{"$f":"IF(AND(D70>0,OR(AX70=\"\")),1,IF((AX70)>D70,1,0))","v":0},null,{"$f":"IF(AND($E70<>0,$AN70=\"\"),1,0)","v":0},{"$f":"IF(AND($E70<>0,$AO70=\"\"),1,0)","v":0},{"$f":"IF(AND($D70<>0,$AP70=\"\"),1,0)","v":0},{"$f":"IF(AND(E70<>0,AQ70=\"\"),1,0)","v":0},{"$f":"IF(AND(D70<>0,AR70=\"\"),1,0)","v":0},{"$f":"IF(AND(E70<>0,AS70=\"\"),1,0)","v":0},{"$f":"IF(AND($C70<>0,AT70=\"\"),1,0)","v":0},{"$f":"IF(AND($C70<>0,AU70=\"\"),1,0)","v":0},{"$f":"IF(AND($C70<>0,AV70=\"\"),1,0)","v":0}]
["FACTORES DE RIESGO Y CONDICIONANTES DE LA SALUD MENTAL"]
["VIOLENCIA ","VICTIMA",{"$f":"SUM(D72:E72)","v":0},{"$f":"+F72+H72+J72+L72+N72+P72+R72+T72+V72+X72+Z72+AB72+AD72+AF72+AH72+AJ72+AL72","v":0},{"$f":"+G72+I72+K72+M72+O72+Q72+S72+U72+W72+Y72+AA72+AC72+AE72+AG72+AI72+AK72+AM72","v":0},null,null,null,null,null,null,null,null,null,null,null,null,null,null,null,null,null,null,null,null,null,null,null,null,null,null,null,null,null,null,null,null,null,null,null,null,null,null,null,null,null,null,null,null,null,{"$f":"$CB72&CC72&CD72&CE72&CF72&CG72&CH72&CI72&CJ72&CK72&CL72&CN72&CO72&CP72&CQ72&CR72&CS72&CT72&CU72&CV72","v":""},null,null,null,null,null,null,null,null,null,null,null,null,null,null,null,null,null,null,null,null,null,null,null,null,null,null,null,null,{"$f":"IF($AN72>$E72,\"* La celda 'Gestantes' debe ser menor o igual al Total de Mujeres en control. \",\"\")","v":""},{"$f":"IF($AO72>$E72,\"* La celda 'Madres de Hijos menor de 5 años' debe ser menor o igual al Total de Mujeres en control. \",\"\")","v":""},{"$f":"IF(($AP72)>$D72,\"* La celda 'Pueblos Originarios / Hombres' debe ser menor o igual al Total de Hombres en control. \",\"\")","v":""},{"$f":"IF($AQ72>$E72,\"* La celda 'Pueblos Originarios / Mujeres' debe ser menor o igual al Total de Mujeres en control. \",\"\")","v":""},{"$f":"IF(($AR72)>$D72,\"* La celda 'Población Migrantes / Hombres' debe ser menor o igual al Total de Hombres en control. \",\"\")","v":""},{"$f":"IF($AS72>$E72,\"* La celda 'Población Migrantes / Mujeres' debe ser menor o igual al Total de Mujeres en control. \",\"\")","v":""},{"$f":"IF($AT72>$C72,\"* La celda 'Niños, Niñas, Adolescentes y Jóvenes de Población SENAME' debe ser menor o igual al Total de Ambos Sexos. \",\"\")","v":""},{"$f":"IF($AU72>$C72,\"* La celda 'Niños, Niñas, Adolescentes y Jóvenes Mejor Niñez' debe ser menor o igual al Total de Ambos Sexos. \",\"\")","v":""},{"$f":"IF($AV72>$C72,\"* La celda 'Plan Cuidado Integral Elaborado' debe ser menor o igual al Total de Personas en control. \",\"\")","v":""},{"$f":"IF(AND(E72>0,OR(AW72=\"\")),\" * No olvide digitar la variable Trans Masculino. (Digite Cero si no tiene).\",IF(AW72>E72,\" * La variable Trans Masculino no debe ser mayor al Total Mujeres.\",\"\"))","v":""},{"$f":"IF(AND(D72>0,OR(AX72=\"\")),\" * No olvide digitar la variable Trans Femenino. (Digite Cero si no tiene).\",IF(AX72>D72,\" * La variable Trans Femenino no debe ser mayor al Total Hombre.\",\"\"))","v":""},null,{"$f":"IF(AND($E72<>0,$AN72=\"\"),\"* No olvide escribir en la celda de 'Gestantes' (Digite CERO si no tiene). \",\"\")","v":""},{"$f":"IF(AND($E72<>0,$AO72=\"\"),\"* No olvide escribir en la celda de 'Madres de Hijos menor de 5 años' (Digite CERO si no tiene). \",\"\")","v":""},{"$f":"IF(AND($D72<>0,$AP72=\"\"),\"* No olvide escribir en las celdas de Pueblos Originarios Hombres. (Digite CERO si no tiene).  \",\"\")","v":""},{"$f":"IF(AND($E72<>0,$AQ72=\"\"),\"* No olvide escribir en las celdas de Pueblos Originarios Mujeres (Digite CERO si no tiene).  \",\"\")","v":""},{"$f":"IF(AND($D72<>0,$AR72=\"\"),\"* No olvide escribir en las celdas de Población Migrantes Hombres. (Digite CERO si no tiene). \",\"\")","v":""},{"$f":"IF(AND($E72<>0,$AS72=\"\"),\"* No olvide escribir en las celdas de Población Migrantes Mujeres. (Digite CERO si no tiene). \",\"\")","v":""},{"$f":"IF(AND($C72<>0,$AT72=\"\"),\"* No olvide escribir en la celda de Niños, Niñas, Adolescentes y Jóvenes SENAME. (Digite CERO si no tiene). \",\"\")","v":""},{"$f":"IF(AND($C72<>0,$AU72=\"\"),\"* No olvide escribir en la celda Niños, Niñas, Adolescentes y Jóvenes Mejor Niñez. (Digite CERO si no tiene). \",\"\")","v":""},{"$f":"IF(AND($C72<>0,$AV72=\"\"),\"* No olvide escribir en la celda Plan Cuidado integral Elaborado. (Digite CERO si no tiene). \",\"\")","v":""},null,null,null,null,{"$f":"IF($AN72>$E72,1,0)","v":0},{"$f":"IF($AO72>$E72,1,0)","v":0},{"$f":"IF(($AP72)>$D72,1,0)","v":0},{"$f":"IF($AQ72>$E72,1,0)","v":0},{"$f":"IF(($AR72)>$D72,1,0)","v":0},{"$f":"IF($AS72>$E72,1,0)","v":0},{"$f":"IF($AT72>$C72,1,0)","v":0},{"$f":"IF($AU72>$C72,1,0)","v":0},{"$f":"IF($AV72>$C72,1,0)","v":0},null,{"$f":"IF(AND(E72>0,OR(AW72=\"\")),1,IF((AW72)>E72,1,0))","v":0},{"$f":"IF(AND(D72>0,OR(AX72=\"\")),1,IF((AX72)>D72,1,0))","v":0},null,{"$f":"IF(AND($E72<>0,$AN72=\"\"),1,0)","v":0},{"$f":"IF(AND($E72<>0,$AO72=\"\"),1,0)","v":0},{"$f":"IF(AND($D72<>0,$AP72=\"\"),1,0)","v":0},{"$f":"IF(AND(E72<>0,AQ72=\"\"),1,0)","v":0},{"$f":"IF(AND(D72<>0,AR72=\"\"),1,0)","v":0},{"$f":"IF(AND(E72<>0,AS72=\"\"),1,0)","v":0},{"$f":"IF(AND($C72<>0,AT72=\"\"),1,0)","v":0},{"$f":"IF(AND($C72<>0,AU72=\"\"),1,0)","v":0},{"$f":"IF(AND($C72<>0,AV72=\"\"),1,0)","v":0}]
[null,"AGRESOR/A",0,0,0,null,null,null,null,null,null,null,null,null,null,null,null,null,null,null,null,null,null,null,null,null,null,null,null,null,null,null,null,null,null,null,null,null,null,null,null,null,null,null,null,null,null,null,null,null,{"$f":"$CB73&CC73&CD73&CE73&CF73&CG73&CH73&CI73&CJ73&CK73&CL73&CN73&CO73&CP73&CQ73&CR73&CS73&CT73&CU73&CV73","v":""},null,null,null,null,null,null,null,null,null,null,null,null,null,null,null,null,null,null,null,null,null,null,null,null,null,null,null,null,{"$f":"IF($AN73>$E73,\"* La celda 'Gestantes' debe ser menor o igual al Total de Mujeres en control. \",\"\")","v":""},"","","","","","","","",{"$f":"IF(AND(E73>0,OR(AW73=\"\")),\" * No olvide digitar la variable Trans Masculino. (Digite Cero si no tiene).\",IF(AW73>E73,\" * La variable Trans Masculino no debe ser mayor al Total Mujeres.\",\"\"))","v":""},{"$f":"IF(AND(D73>0,OR(AX73=\"\")),\" * No olvide digitar la variable Trans Femenino. (Digite Cero si no tiene).\",IF(AX73>D73,\" * La variable Trans Femenino no debe ser mayor al Total Hombre.\",\"\"))","v":""},null,"","",{"$f":"IF(AND($D73<>0,$AP73=\"\"),\"* No olvide escribir en las celdas de Pueblos Originarios Hombres. (Digite CERO si no tiene).  \",\"\")","v":""},{"$f":"IF(AND($E73<>0,$AQ73=\"\"),\"* No olvide escribir en las celdas de Pueblos Originarios Mujeres (Digite CERO si no tiene).  \",\"\")","v":""},{"$f":"IF(AND($D73<>0,$AR73=\"\"),\"* No olvide escribir en las celdas de Población Migrantes Hombres. (Digite CERO si no tiene). \",\"\")","v":""},{"$f":"IF(AND($E73<>0,$AS73=\"\"),\"* No olvide escribir en las celdas de Población Migrantes Mujeres. (Digite CERO si no tiene). \",\"\")","v":""},"","","",null,null,null,null,0,0,0,0,0,0,0,0,0,null,0,0,null,0,0,0,0,0,0,0,0,0]
["ABUSO SEXUAL",null,0,0,0,null,null,null,null,null,null,null,null,null,null,null,null,null,null,null,null,null,null,null,null,null,null,null,null,null,null,null,null,null,null,null,null,null,null,null,null,null,null,null,null,null,null,null,null,null,"",null,null,null,null,null,null,null,null,null,null,null,null,null,null,null,null,null,null,null,null,null,null,null,null,null,null,null,null,"","","","","","","","","","","",null,"","","","","","","","","",null,null,null,null,0,0,0,0,0,0,0,0,0,null,0,0,null,0,0,0,0,0,0,0,0,0]
["SUICIDIO","IDEACIÓN",{"$f":"SUM(D75:E75)","v":0},{"$f":"+H75+J75+L75+N75+P75+R75+T75+V75+X75+Z75+AB75+AD75+AF75+AH75+AJ75+AL75","v":0},{"$f":"+I75+K75+M75+O75+Q75+S75+U75+W75+Y75+AA75+AC75+AE75+AG75+AI75+AK75+AM75","v":0},null,null,null,null,null,null,null,null,null,null,null,null,null,null,null,null,null,null,null,null,null,null,null,null,null,null,null,null,null,null,null,null,null,null,null,null,null,null,null,null,null,null,null,null,null,"",null,null,null,null,null,null,null,null,null,null,null,null,null,null,null,null,null,null,null,null,null,null,null,null,null,null,null,null,"","","","","","","","","","","",null,"","","","","","","","","",null,null,null,null,0,0,0,0,0,0,0,0,0,null,0,0,null,0,0,0,0,0,0,0,0,0]
[null,"INTENTO",{"$f":"SUM(D76:E76)","v":0},{"$f":"+H76+J76+L76+N76+P76+R76+T76+V76+X76+Z76+AB76+AD76+AF76+AH76+AJ76+AL76","v":0},{"$f":"+I76+K76+M76+O76+Q76+S76+U76+W76+Y76+AA76+AC76+AE76+AG76+AI76+AK76+AM76","v":0},null,null,null,null,null,null,null,null,null,null,null,null,null,null,null,null,null,null,null,null,null,null,null,null,null,null,null,null,null,null,null,null,null,null,null,null,null,null,null,null,null,null,null,null,null,"",null,null,null,null,null,null,null,null,null,null,null,null,null,null,null,null,null,null,null,null,null,null,null,null,null,null,null,null,"","","","","","","","","","","",null,"","","","","","","","","",null,null,null,null,0,0,0,0,0,0,0,0,0,null,0,0,null,0,0,0,0,0,0,0,0,0]
["PERSONAS CON DIAGNOSTICOS DE TRASTORNOS MENTALES ",null,0,0,0,null,null,null,null,null,null,null,null,null,null,null,null,null,null,null,null,null,null,null,null,null,null,null,null,null,null,null,null,null,null,null,null,null,null,null,null,null,null,null,null,null,null,null,null,null,"",null,null,null,null,null,null,null,null,null,null,null,null,null,null,null,null,null,null,null,null,null,null,null,null,null,null,null,null,"","","","","","","","","","","",null,"","","","","","",{"$f":"IF(AND($C77<>0,$AT77=\"\"),\"* No olvide escribir en la celda de Niños, Niñas, Adolescentes y Jóvenes SENAME. (Digite CERO si no tiene). \",\"\")","v":""},"","",null,null,null,null,0,0,0,0,0,0,0,0,0,null,0,0,null,0,0,0,0,0,0,0,0,0]
["TRASTORNOS DEL HUMOR\n(AFECTIVOS)","DEPRESIÓN REFRACTARIA",{"$f":"SUM(D78:E78)","v":0},0,0,null,null,null,null,null,null,null,null,null,null,null,null,null,null,null,null,null,null,null,null,null,null,null,null,null,null,null,null,null,null,null,null,null,null,null,null,null,null,null,null,null,null,null,null,null,"",null,null,null,null,null,null,null,null,null,null,null,null,null,null,null,null,null,null,null,null,null,null,null,null,null,null,null,null,"","","","","","","","","","","",null,"","","","","","","","","",null,null,null,null,0,0,0,0,0,0,0,0,0,null,0,0,null,0,0,0,0,0,0,0,0,0]
[null,"DEPRESIÓN GRAVE CON PSICOSIS",0,0,0,null,null,null,null,null,null,null,null,null,null,null,null,null,null,null,null,null,null,null,null,null,null,null,null,null,null,null,null,null,null,null,null,null,null,null,null,null,null,null,null,null,null,null,null,null,"",null,null,null,null,null,null,null,null,null,null,null,null,null,null,null,null,null,null,null,null,null,null,null,null,null,null,null,null,"","","","","","","","","","","",null,"","","","","","","","","",null,null,null,null,{"$f":"IF($AN79>$E79,1,0)","v":0},0,0,0,0,0,0,0,0,null,0,0,null,0,0,0,0,0,0,0,0,0]
[null,"DEPRESIÓN CON ALTO RIESGO SUICIDA",0,0,0,null,null,null,null,null,null,null,null,null,null,null,null,null,null,null,null,null,null,null,null,null,null,null,null,null,null,null,null,null,null,null,null,null,null,null,null,null,null,null,null,null,null,null,null,null,"",null,null,null,null,null,null,null,null,null,null,null,null,null,null,null,null,null,null,null,null,null,null,null,null,null,null,null,null,"","","","","","","","","","","",null,"","","","","","","","","",null,null,null,null,0,0,0,0,0,0,0,0,0,null,0,0,null,0,{"$f":"IF(AND($E80<>0,$AO80=\"\"),1,0)","v":0},0,0,0,0,0,0,0]
[null,"DEPRESIÓN POST PARTO",{"$f":"SUM(D81:E81)","v":0},null,{"$f":"K81+M81+O81+Q81+S81+U81+W81+Y81+AA81+AC81","v":0},null,null,null,null,null,null,null,null,null,null,null,null,null,null,null,null,null,null,null,null,null,null,null,null,null,null,null,null,null,null,null,null,null,null,null,null,null,null,null,null,null,null,null,null,null,"",null,null,null,null,null,null,null,null,null,null,null,null,null,null,null,null,null,null,null,null,null,null,null,null,null,null,null,null,"","",null,"",null,"","","","",{"$f":"IF(AND(E81>0,OR(AW81=\"\")),\" * No olvide digitar la variable Trans Masculino. (Digite Cero si no tiene).\",IF(AW81>E81,\" * La variable Trans Masculino no debe ser mayor al Total Mujeres.\",\"\"))","v":""},null,null,null,{"$f":"IF(AND($E81<>0,$AO81=\"\"),\"* No olvide escribir en la celda de 'Madres de Hijos menor de 5 años' (Digite CERO si no tiene). \",\"\")","v":""},null,"",null,"","",{"$f":"IF(AND($C81<>0,$AU81=\"\"),\"* No olvide escribir en la celda Niños, Niñas, Adolescentes y Jóvenes Mejor Niñez. (Digite CERO si no tiene). \",\"\")","v":""},"",null,null,null,null,null,{"$f":"IF($AO81>$E81,1,0)","v":0},null,0,null,0,0,0,0,null,0,null,null,null,{"$f":"IF(AND($E81<>0,$AO81=\"\"),1,0)","v":0},null,0,null,0,0,0,0]
[null,"TRASTORNO BIPOLAR",{"$f":"SUM(D82:E82)","v":0},{"$f":"+F82+H82+J82+L82+N82+P82+R82+T82+V82+X82+Z82+AB82+AD82+AF82+AH82+AJ82+AL82","v":0},0,null,null,null,null,null,null,null,null,null,null,null,null,null,null,null,null,null,null,null,null,null,null,null,null,null,null,null,null,null,null,null,null,null,null,null,null,null,null,null,null,null,null,null,null,null,"",null,null,null,null,null,null,null,null,null,null,null,null,null,null,null,null,null,null,null,null,null,null,null,null,null,null,null,null,"","",{"$f":"IF(($AP82)>$D82,\"* La celda 'Pueblos Originarios / Hombres' debe ser menor o igual al Total de Hombres en control. \",\"\")","v":""},"",{"$f":"IF(($AR82)>$D82,\"* La celda 'Población Migrantes / Hombres' debe ser menor o igual al Total de Hombres en control. \",\"\")","v":""},"","","","",{"$f":"IF(AND(E82>0,OR(AW82=\"\")),\" * No olvide digitar la variable Trans Masculino. (Digite Cero si no tiene).\",IF(AW82>E82,\" * La variable Trans Masculino no debe ser mayor al Total Mujeres.\",\"\"))","v":""},{"$f":"IF(AND(D82>0,OR(AX82=\"\")),\" * No olvide digitar la variable Trans Femenino. (Digite Cero si no tiene).\",IF(AX82>D82,\" * La variable Trans Femenino no debe ser mayor al Total Hombre.\",\"\"))","v":""},null,{"$f":"IF(AND($E82<>0,$AN82=\"\"),\"* No olvide escribir en la celda de 'Gestantes' (Digite CERO si no tiene). \",\"\")","v":""},{"$f":"IF(AND($E82<>0,$AO82=\"\"),\"* No olvide escribir en la celda de 'Madres de Hijos menor de 5 años' (Digite CERO si no tiene). \",\"\")","v":""},"","","","","","","",null,null,null,null,0,{"$f":"IF($AO82>$E82,1,0)","v":0},{"$f":"IF(($AP82)>$D82,1,0)","v":0},0,{"$f":"IF(($AR82)>$D82,1,0)","v":0},0,0,0,0,null,0,{"$f":"IF(AND(D82>0,OR(AX82=\"\")),1,IF((AX82)>D82,1,0))","v":0},null,{"$f":"IF(AND($E82<>0,$AN82=\"\"),1,0)","v":0},{"$f":"IF(AND($E82<>0,$AO82=\"\"),1,0)","v":0},{"$f":"IF(AND($D82<>0,$AP82=\"\"),1,0)","v":0},0,{"$f":"IF(AND(D82<>0,AR82=\"\"),1,0)","v":0},0,0,0,0]
["TRASTORNOS MENTALES Y DEL COMPORTAMIENTO DEBIDO A CONSUMO SUSTANCIAS PSICOTROPICAS","CONSUMO PERJUDICIAL DE ALCOHOL ",0,0,0,null,null,null,null,null,null,null,null,null,null,null,null,null,null,null,null,null,null,null,null,null,null,null,null,null,null,null,null,null,null,null,null,null,null,null,null,null,null,null,null,null,null,null,null,null,"",null,null,null,null,null,null,null,null,null,null,null,null,null,null,null,null,null,null,null,null,null,null,null,null,null,null,null,null,"","","","","","","","","","","",null,"","","","","","","","","",null,null,null,null,{"$f":"IF($AN83>$E83,1,0)","v":0},0,0,0,0,0,0,0,0,null,0,0,null,0,0,0,0,0,0,0,0,0]
[null,"CONSUMO DEPENDIENTE DEL ALCOHOL ",0,0,0,null,null,null,null,null,null,null,null,null,null,null,null,null,null,null,null,null,null,null,null,null,null,null,null,null,null,null,null,null,null,null,null,null,null,null,null,null,null,null,null,null,null,null,null,null,"",null,null,null,null,null,null,null,null,null,null,null,null,null,null,null,null,null,null,null,null,null,null,null,null,null,null,null,null,"","","","","","","","","","","",null,"","","","","","","","","",null,null,null,null,0,0,0,0,0,0,0,0,0,null,0,0,null,0,0,0,0,0,0,0,0,0]
[null,"CONSUMO PERJUDICIAL DE DROGAS",0,{"$f":"+F85+H85+J85+L85+N85+P85+R85+T85+V85+X85+Z85+AB85+AD85+AF85+AH85+AJ85+AL85","v":0},0,null,null,null,null,null,null,null,null,null,null,null,null,null,null,null,null,null,null,null,null,null,null,null,null,null,null,null,null,null,null,null,null,null,null,null,null,null,null,null,null,null,null,null,null,null,"",null,null,null,null,null,null,null,null,null,null,null,null,null,null,null,null,null,null,null,null,null,null,null,null,null,null,null,null,"","",null,null,null,null,null,"","","","",null,"","","","","","","","","",null,null,null,null,0,0,0,0,0,0,0,0,0,null,0,0,null,0,0,0,0,0,0,0,0,0]
[null,"CONSUMO DEPENDIENTE DE DROGAS ",0,0,0,null,null,null,null,null,null,null,null,null,null,null,null,null,null,null,null,null,null,null,null,null,null,null,null,null,null,null,null,null,null,null,null,null,null,null,null,null,null,null,null,null,null,null,null,null,"",null,null,null,null,null,null,null,null,null,null,null,null,null,null,null,null,null,null,null,null,null,null,null,null,null,null,null,null,"","",null,null,null,null,null,"","","","",null,"","","","","","","","","",null,null,null,null,0,{"$f":"IF($AO86>$E86,1,0)","v":0},0,0,0,0,0,0,0,null,0,0,null,0,0,0,0,0,0,0,0,0]
[null,"CONSUMO DE DROGAS Y ALCOHOL ",0,0,0,null,null,null,null,null,null,null,null,null,null,null,null,null,null,null,null,null,null,null,null,null,null,null,null,null,null,null,null,null,null,null,null,null,null,null,null,null,null,null,null,null,null,null,null,null,"",null,null,null,null,null,null,null,null,null,null,null,null,null,null,null,null,null,null,null,null,null,null,null,null,null,null,null,null,"","","","","","","","","","","",null,"","","","","","","","","",null,null,null,null,0,0,0,0,0,0,0,0,0,null,0,0,null,{"$f":"IF(AND($E87<>0,$AN87=\"\"),1,0)","v":0},0,{"$f":"IF(AND($D87<>0,$AP87=\"\"),1,0)","v":0},0,0,0,0,0,0]
["TRASTORNOS DEL COMPORTAMIENTO Y DE LAS EMOCIONES DE COMIENZO HABITUAL EN LA INFANCIA Y ADOLESCENCIA","TRASTORNO HIPERCINÉTICO",0,0,0,null,null,null,null,null,null,null,null,null,null,null,null,null,null,null,null,null,null,null,null,null,null,null,null,null,null,null,null,null,null,null,null,null,null,null,null,null,null,null,null,null,null,null,null,null,"",null,null,null,null,null,null,null,null,null,null,null,null,null,null,null,null,null,null,null,null,null,null,null,null,null,null,null,null,"","","","","","","","","","","",null,"","","","","","","","","",null,null,null,null,0,null,0,0,0,0,0,0,0,null,0,0,null,{"$f":"IF(AND($E88<>0,$AN88=\"\"),1,0)","v":0},null,0,0,0,0,0,0,0]
[null,"TRASTORNO DISOCIAL DESAFIANTE Y OPOSICIONISTA",0,0,0,null,null,null,null,null,null,null,null,null,null,null,null,null,null,null,null,null,null,null,null,null,null,null,null,null,null,null,null,null,null,null,null,null,null,null,null,null,null,null,null,null,null,null,null,null,"",null,null,null,null,null,null,null,null,null,null,null,null,null,null,null,null,null,null,null,null,null,null,null,null,null,null,null,null,"","","","","","","","","","","",null,"","","","","","","","","",null,null,null,null,{"$f":"IF($AN89>$E89,1,0)","v":0},null,0,0,0,0,0,0,0,null,0,0,null,{"$f":"IF(AND($E89<>0,$AN89=\"\"),1,0)","v":0},null,0,0,0,0,0,0,0]
[null,"TRASTORNO DE ANSIEDAD DE SEPARACIÓN EN LA INFANCIA",0,{"$f":"+F90+H90+J90","v":0},{"$f":"+G90+I90+K90","v":0},null,null,null,null,null,null,null,null,null,null,null,null,null,null,null,null,null,null,null,null,null,null,null,null,null,null,null,null,null,null,null,null,null,null,null,null,null,null,null,null,null,null,null,null,null,"",null,null,null,null,null,null,null,null,null,null,null,null,null,null,null,null,null,null,null,null,null,null,null,null,null,null,null,null,"","","","","","","","","","","",null,"","","","","","","","","",null,null,null,null,0,null,0,0,0,0,0,0,0,null,0,0,null,0,null,0,0,0,0,0,0,0]
[null,"OTROS TRASTORNOS DEL COMPORTAMIENTO Y DE LAS EMOCIONES DE COMIENZO HABITUAL EN LA INFANCIA Y ADOLESCENCIA",{"$f":"SUM(D91:E91)","v":0},{"$f":"+F91+H91+J91+L91+N91","v":0},{"$f":"+G91+I91+K91+M91+O91","v":0},null,null,null,null,null,null,null,null,null,null,null,null,null,null,null,null,null,null,null,null,null,null,null,null,null,null,null,null,null,null,null,null,null,null,null,null,null,null,null,null,null,null,null,null,null,"",null,null,null,null,null,null,null,null,null,null,null,null,null,null,null,null,null,null,null,null,null,null,null,null,null,null,null,null,"","","","","","","","","","","",null,"","","","","","","","",{"$f":"IF(AND($C91<>0,$AV91=\"\"),\"* No olvide escribir en la celda Plan Cuidado integral Elaborado. (Digite CERO si no tiene). \",\"\")","v":""},null,null,null,null,0,null,0,0,0,0,0,0,0,null,0,0,null,0,null,0,0,0,0,0,0,0]
["TRASTORNOS DE ANSIEDAD","TRASTORNO DE ESTRÉS POST TRAUMATICO",0,{"$f":"SUM(F92+H92+J92+L92+N92+P92+R92+T92+V92+X92+Z92+AB92+AD92+AF92+AH92+AJ92+AL92)","v":0},0,null,null,null,null,null,null,null,null,null,null,null,null,null,null,null,null,null,null,null,null,null,null,null,null,null,null,null,null,null,null,null,null,null,null,null,null,null,null,null,null,null,null,null,null,null,"",null,null,null,null,null,null,null,null,null,null,null,null,null,null,null,null,null,null,null,null,null,null,null,null,null,null,null,null,"","","","","","","","","","","",null,"","","","","","","","","",null,null,null,null,0,{"$f":"IF($AO92>$E92,1,0)","v":0},0,0,0,0,0,0,0,null,{"$f":"IF(AND(E92>0,OR(AW92=\"\")),1,IF((AW92)>E92,1,0))","v":0},0,null,0,{"$f":"IF(AND($E92<>0,$AO92=\"\"),1,0)","v":0},0,{"$f":"IF(AND(E92<>0,AQ92=\"\"),1,0)","v":0},0,{"$f":"IF(AND(E92<>0,AS92=\"\"),1,0)","v":0},{"$f":"IF(AND($C92<>0,AT92=\"\"),1,0)","v":0},{"$f":"IF(AND($C92<>0,AU92=\"\"),1,0)","v":0},{"$f":"IF(AND($C92<>0,AV92=\"\"),1,0)","v":0}]
[null,"TRASTORNO DE PÁNICO  ",0,0,0,null,null,null,null,null,null,null,null,null,null,null,null,null,null,null,null,null,null,null,null,null,null,null,null,null,null,null,null,null,null,null,null,null,null,null,null,null,null,null,null,null,null,null,null,null,"",null,null,null,null,null,null,null,null,null,null,null,null,null,null,null,null,null,null,null,null,null,null,null,null,null,null,null,null,"","","","","","","","","","","",null,"","","","","","","","","",null,null,null,null,0,0,0,0,0,0,0,0,0,null,0,0,null,0,0,0,0,0,0,0,0,0]
[null,"FOBIAS SOCIALES",0,0,0,null,null,null,null,null,null,null,null,null,null,null,null,null,null,null,null,null,null,null,null,null,null,null,null,null,null,null,null,null,null,null,null,null,null,null,null,null,null,null,null,null,null,null,null,null,"",null,null,null,null,null,null,null,null,null,null,null,null,null,null,null,null,null,null,null,null,null,null,null,null,null,null,null,null,"","","","","","","","","","","",null,"","","","","","","","","",null,null,null,null,0,0,0,0,0,0,0,0,0,null,0,0,null,0,0,0,0,0,0,0,0,0]
[null,"TRASTORNOS DE ANSIEDAD GENERALIZADA",0,0,0,null,null,null,null,null,null,null,null,null,null,null,null,null,null,null,null,null,null,null,null,null,null,null,null,null,null,null,null,null,null,null,null,null,null,null,null,null,null,null,null,null,null,null,null,null,"",null,null,null,null,null,null,null,null,null,null,null,null,null,null,null,null,null,null,null,null,null,null,null,null,null,null,null,null,"","","","","","","","","","","",null,"","","","","","","","","",null,null,null,null,0,0,0,0,0,0,0,0,0,null,0,0,null,0,0,0,0,0,0,0,0,0]
[null,"OTROS TRASTORNOS DE ANSIEDAD",0,0,0,null,null,null,null,null,null,null,null,null,null,null,null,null,null,null,null,null,null,null,null,null,null,null,null,null,null,null,null,null,null,null,null,null,null,null,null,null,null,null,null,null,null,null,null,null,"",null,null,null,null,null,null,null,null,null,null,null,null,null,null,null,null,null,null,null,null,null,null,null,null,null,null,null,null,"","","","","","","","","","","",null,"","","","","","","","","",null,null,null,null,0,0,0,0,0,0,0,0,0,null,0,0,null,0,0,0,0,0,0,0,0,0]
["DEMENCIAS (INCLUYE ALZHEIMER)","LEVE",{"$f":"SUM(D97:E97)","v":0},{"$f":"+F97+H97+J97+L97+N97+P97+R97+T97+V97+X97+Z97+AB97+AD97+AF97+AH97+AJ97+AL97","v":0},{"$f":"+G97+I97+K97+M97+O97+Q97+S97+U97+W97+Y97+AA97+AC97+AE97+AG97+AI97+AK97+AM97","v":0},null,null,null,null,null,null,null,null,null,null,null,null,null,null,null,null,null,null,null,null,null,null,null,null,null,null,null,null,null,null,null,null,null,null,null,null,null,null,null,null,null,null,null,null,null,"",null,null,null,null,null,null,null,null,null,null,null,null,null,null,null,null,null,null,null,null,null,null,null,null,null,null,null,null,"","","","","","","","","","","",null,"","","","","","","","","",null,null,null,null,0,0,0,0,0,0,0,0,0,null,0,0,null,null,null,{"$f":"IF(AND($D97<>0,$AP97=\"\"),1,IF(AND($E97<>0,$AQ97=\"\"),1,0))","v":0},null,0,0,0,0,0]
[null,"MODERADO",0,0,{"$f":"+G98+I98+K98+M98+O98+Q98+S98+U98+W98+Y98+AA98+AC98+AE98+AG98+AI98+AK98+AM98","v":0},null,null,null,null,null,null,null,null,null,null,null,null,null,null,null,null,null,null,null,null,null,null,null,null,null,null,null,null,null,null,null,null,null,null,null,null,null,null,null,null,null,null,null,null,null,"",null,null,null,null,null,null,null,null,null,null,null,null,null,null,null,null,null,null,null,null,null,null,null,null,null,null,null,null,"","","","","","","","","","","",null,"","","","","","","","","",null,null,null,null,0,0,0,0,0,0,0,0,0,null,0,0,null,null,null,0,null,0,0,0,0,0]
[null,"AVANZADO",0,0,0,null,null,null,null,null,null,null,null,null,null,null,null,null,null,null,null,null,null,null,null,null,null,null,null,null,null,null,null,null,null,null,null,null,null,null,null,null,null,null,null,null,null,null,null,null,"",null,null,null,null,null,null,null,null,null,null,null,null,null,null,null,null,null,null,null,null,null,null,null,null,null,null,null,null,"","","","","","","","","","","",null,"","","","","","","","","",null,null,null,null,0,0,0,0,0,0,0,0,0,null,0,0,null,null,null,0,null,0,0,0,0,0]
["ESQUIZOFRENIA",null,{"$f":"SUM(D100:E100)","v":0},{"$f":"+F100+H100+J100+L100+N100+P100+R100+T100+V100+X100+Z100+AB100+AD100+AF100+AH100+AJ100+AL100","v":0},{"$f":"+G100+I100+K100+M100+O100+Q100+S100+U100+W100+Y100+AA100+AC100+AE100+AG100+AI100+AK100+AM100","v":0},null,null,null,null,null,null,null,null,null,null,null,null,null,null,null,null,null,null,null,null,null,null,null,null,null,null,null,null,null,null,null,null,null,null,null,null,null,null,null,null,null,null,null,null,null,"",null,null,null,null,null,null,null,null,null,null,null,null,null,null,null,null,null,null,null,null,null,null,null,null,null,null,null,null,"","","","","","","","","",{"$f":"IF(AND(E100>0,OR(AW100=\"\")),\" * No olvide digitar la variable Trans Masculino. (Digite Cero si no tiene).\",IF(AW100>E100,\" * La variable Trans Masculino no debe ser mayor al Total Mujeres.\",\"\"))","v":""},{"$f":"IF(AND(D100>0,OR(AX100=\"\")),\" * No olvide digitar la variable Trans Femenino. (Digite Cero si no tiene).\",IF(AX100>D100,\" * La variable Trans Femenino no debe ser mayor al Total Hombre.\",\"\"))","v":""},null,"","","","","","","","","",null,null,null,null,0,0,0,0,0,0,0,0,0,null,0,{"$f":"IF(AND(D100>0,OR(AX100=\"\")),1,IF((AX100)>D100,1,0))","v":0},null,{"$f":"IF(AND($E100<>0,$AN100=\"\"),1,0)","v":0},{"$f":"IF(AND($E100<>0,$AO100=\"\"),1,0)","v":0},{"$f":"IF(AND($D100<>0,$AP100=\"\"),1,0)","v":0},{"$f":"IF(AND(E100<>0,AQ100=\"\"),1,0)","v":0},{"$f":"IF(AND(D100<>0,AR100=\"\"),1,0)","v":0},0,0,0,0]
["TRASTORNO ADAPTATIVO",null,0,0,0,null,null,null,null,null,null,null,null,null,null,null,null,null,null,null,null,null,null,null,null,null,null,null,null,null,null,null,null,null,null,null,null,null,null,null,null,null,null,null,null,null,null,null,null,null,"",null,null,null,null,null,null,null,null,null,null,null,null,null,null,null,null,null,null,null,null,null,null,null,null,null,null,null,null,"","","","","","","","","","","",null,"","","","","","","","","",null,null,null,null,0,0,0,0,0,0,0,0,0,null,0,0,null,0,0,0,0,0,0,0,0,0]
["TRASTORNOS DE LA CONDUCTA ALIMENTARIA",null,0,0,0,null,null,null,null,null,null,null,null,null,null,null,null,null,null,null,null,null,null,null,null,null,null,null,null,null,null,null,null,null,null,null,null,null,null,null,null,null,null,null,null,null,null,null,null,null,"",null,null,null,null,null,null,null,null,null,null,null,null,null,null,null,null,null,null,null,null,null,null,null,null,null,null,null,null,"","","","","","","","","","","",null,"","","","","","","","","",null,null,null,null,0,0,0,0,0,0,0,0,0,null,0,0,null,0,0,0,0,0,0,0,0,0]
["RETRASO MENTAL",null,0,0,0,null,null,null,null,null,null,null,null,null,null,null,null,null,null,null,null,null,null,null,null,null,null,null,null,null,null,null,null,null,null,null,null,null,null,null,null,null,null,null,null,null,null,null,null,null,"",null,null,null,null,null,null,null,null,null,null,null,null,null,null,null,null,null,null,null,null,null,null,null,null,null,null,null,null,"","","","","","","","","","","",null,"","","","","","","","","",null,null,null,null,0,0,0,0,0,0,0,0,0,null,0,0,null,0,0,0,0,0,0,0,0,0]
["TRASTORNO DE PERSONALIDAD",null,0,0,0,null,null,null,null,null,null,null,null,null,null,null,null,null,null,null,null,null,null,null,null,null,null,null,null,null,null,null,null,null,null,null,null,null,null,null,null,null,null,null,null,null,null,null,null,null,"",null,null,null,null,null,null,null,null,null,null,null,null,null,null,null,null,null,null,null,null,null,null,null,null,null,null,null,null,"","","","","","","","","","","",null,"","","","","","","","","",null,null,null,null,0,0,0,0,0,0,0,0,0,null,0,0,null,0,0,0,0,0,0,0,0,0]
["TRASTORNO GENERALIZADOS DEL DESARROLLO","AUTISMO",{"$f":"SUM(D105:E105)","v":0},{"$f":"+F105+H105+J105+L105+N105+P105+R105+T105+V105+X105+Z105+AB105+AD105+AF105+AH105+AJ105+AL105","v":0},{"$f":"+G105+I105+K105+M105+O105+Q105+S105+U105+W105+Y105+AA105+AC105+AE105+AG105+AI105+AK105+AM105","v":0},null,null,null,null,null,null,null,null,null,null,null,null,null,null,null,null,null,null,null,null,null,null,null,null,null,null,null,null,null,null,null,null,null,null,null,null,null,null,null,null,null,null,null,null,null,"",null,null,null,null,null,null,null,null,null,null,null,null,null,null,null,null,null,null,null,null,null,null,null,null,null,null,null,null,"","","","","","","","","","","",null,"","","","","","","","","",null,null,null,null,0,0,0,0,0,0,0,0,0,null,0,0,null,0,0,0,0,0,0,0,0,0]
[null,"ASPERGER",0,0,0,null,null,null,null,null,null,null,null,null,null,null,null,null,null,null,null,null,null,null,null,null,null,null,null,null,null,null,null,null,null,null,null,null,null,null,null,null,null,null,null,null,null,null,null,null,"",null,null,null,null,null,null,null,null,null,null,null,null,null,null,null,null,null,null,null,null,null,null,null,null,null,null,null,null,"","","","","","","","","","","",null,"","","","","","","","","",null,null,null,null,0,0,0,0,0,0,0,0,0,null,0,0,null,0,0,0,0,0,0,0,0,0]
[null,"SÍNDROME DE RETT",0,0,0,null,null,null,null,null,null,null,null,null,null,null,null,null,null,null,null,null,null,null,null,null,null,null,null,null,null,null,null,null,null,null,null,null,null,null,null,null,null,null,null,null,null,null,null,null,{"$f":"$CB107&CC107&CD107&CE107&CF107&CG107&CH107&CI107&CJ107&CK107&CL107&CN107&CO107&CP107&CQ107&CR107&CS107&CT107&CU107&CV107","v":""},null,null,null,null,null,null,null,null,null,null,null,null,null,null,null,null,null,null,null,null,null,null,null,null,null,null,null,null,"","","","","","","","","","","",null,"","","","","","","","","",null,null,null,null,0,0,0,0,0,0,0,0,0,null,0,0,null,0,0,0,0,0,0,0,0,0]
[null,"TRASTORNO DESINTEGRATIVO DE LA INFANCIA",0,0,0,null,null,null,null,null,null,null,null,null,null,null,null,null,null,null,null,null,null,null,null,null,null,null,null,null,null,null,null,null,null,null,null,null,null,null,null,null,null,null,null,null,null,null,null,null,"",null,null,null,null,null,null,null,null,null,null,null,null,null,null,null,null,null,null,null,null,null,null,null,null,null,null,null,null,"","","","","","","","","","","",null,"","","","","","","","","",null,null,null,null,0,0,0,0,0,0,0,0,0,null,0,0,null,0,0,0,0,0,0,0,0,0]
[null,"TRASTONO GENERALIZADO DEL DESARROLLO NO ESPECÍFICO",0,0,0,null,null,null,null,null,null,null,null,null,null,null,null,null,null,null,null,null,null,null,null,null,null,null,null,null,null,null,null,null,null,null,null,null,null,null,null,null,null,null,null,null,null,null,null,null,"",null,null,null,null,null,null,null,null,null,null,null,null,null,null,null,null,null,null,null,null,null,null,null,null,null,null,null,null,"","","","","","","","","","","",null,"","","","","","","","","",null,null,null,null,0,0,0,0,0,0,0,0,0,null,0,0,null,0,0,0,0,0,0,0,0,0]
["EPILEPSIA",null,{"$f":"SUM(D110+E110)","v":0},{"$f":"SUM(F110+H110+J110+L110+N110+P110+R110+T110+V110+X110+Z110+AB110+AD110+AF110+AH110+AJ110+AL110)","v":0},{"$f":"SUM(G110+I110+K110+M110+O110+Q110+S110+U110+W110+Y110+AA110+AC110+AE110+AG110+AI110+AK110+AM110)","v":0},null,null,null,null,null,null,null,null,null,null,null,null,null,null,null,null,null,null,null,null,null,null,null,null,null,null,null,null,null,null,null,null,null,null,null,null,null,null,null,null,null,null,null,null,null,"",null,null,null,null,null,null,null,null,null,null,null,null,null,null,null,null,null,null,null,null,null,null,null,null,null,null,null,null,"","","","","","","","","","","",null,"","","","","","","","","",null,null,null,null,0,0,0,0,0,0,0,0,0,null,0,0,null,0,0,0,0,0,0,0,0,0]
["OTRAS",null,0,{"$f":"+F111+H111+J111+L111+N111+P111+R111+T111+V111+X111+Z111+AB111+AD111+AF111+AH111+AJ111+AL111","v":0},{"$f":"+G111+I111+K111+M111+O111+Q111+S111+U111+W111+Y111+AA111+AC111+AE111+AG111+AI111+AK111+AM111","v":0},null,null,null,null,null,null,null,null,null,null,null,null,null,null,null,null,null,null,null,null,null,null,null,null,null,null,null,null,null,null,null,null,null,null,null,null,null,null,null,null,null,null,null,null,null,"",null,null,null,null,null,null,null,null,null,null,null,null,null,null,null,null,null,null,null,null,null,null,null,null,null,null,null,null,"","","","","","","","","","","",null,"","","","","","","","","",null,null,null,null,0,0,0,0,0,0,0,0,0,null,0,0,null,0,0,0,0,0,0,0,0,0]
["SECCION B.2: PROGRAMA DE REHABILITACIÓN EN ESPECIALIDAD (PERSONAS CON TRANSTORNOS PSIQUIÁTRICO)"]
["TIPO","RUBRO","T O T A L",null,null,"GRUPO DE EDAD (en años)"]
[null,null,null,null,null,"0 a 4 años",null,"5 a 9 años",null,"10 a 14 años",null,"15 a 19 años",null,"20 a 24 años",null,"25 a 29 años",null,"30 a 34 años",null,"35 a 39 años",null,"40 a 44 años",null,"45 a 49 años",null,"50 a 54 años",null,"55 a 59 años",null,"60 a 64 años",null,"65 a 69 años",null,"70 a 74 años",null,"75 a 79 años",null,"80 y más años"]
[null,null,"Ambos\nsexos","Hombres","Mujeres","Hombres","Mujeres","Hombres","Mujeres","Hombres","Mujeres","Hombres","Mujeres","Hombres","Mujeres","Hombres","Mujeres","Hombres","Mujeres","Hombres","Mujeres","Hombres","Mujeres","Hombres","Mujeres","Hombres","Mujeres","Hombres","Mujeres","Hombres","Mujeres","Hombres","Mujeres","Hombres","Mujeres","Hombres","Mujeres","Hombres","Mujeres"]
["PROGRAMA DE REHABILITACIÓN TIPO I","NÚMERO DE PERSONAS EN CONTROL EN EL PROGRAMA",{"$f":"SUM(D116:E116)","v":0},{"$f":"+F116+H116+J116+L116+N116+P116+R116+T116+V116+X116+Z116+AB116+AD116+AF116+AH116+AJ116+AL116","v":0},{"$f":"+G116+I116+K116+M116+O116+Q116+S116+U116+W116+Y116+AA116+AC116+AE116+AG116+AI116+AK116+AM116","v":0}]
["PROGRAMA DE REHABILITACIÓN TIPO II","NÚMERO DE PERSONAS EN CONTROL EN EL PROGRAMA",{"$f":"SUM(D117:E117)","v":0},{"$f":"+F117+H117+J117+L117+N117+P117+R117+T117+V117+X117+Z117+AB117+AD117+AF117+AH117+AJ117+AL117","v":0},{"$f":"+G117+I117+K117+M117+O117+Q117+S117+U117+W117+Y117+AA117+AC117+AE117+AG117+AI117+AK117+AM117","v":0}]
[]
[]
[]
[]
[]
[]
[]
[]
[]
[]
[]
[]
[]
[]
[]
[]
[]
[]
[]
[{"$f":"SUM(C13:C54,C59:C60,C65,C70:C111,C116:C117)","v":0},"datos"]
[{"$f":"SUM(DA13:DV111)","v":0},"errores"]

{"sheet":"P7","index":7,"n_rows":50,"n_cols":12,"rows_kept":50,"cut":false,"hidden":false,"merged":[[22,0,22,2],[6,0,6,9],[28,1,28,2],[27,1,27,2],[26,1,26,2],[25,1,25,2],[23,0,23,2],[27,0,31,0],[29,1,29,2],[30,1,30,2],[31,1,31,2],[24,1,24,2],[24,0,26,0]]}
["DATOS DEL ESTABLECIMIENTO"]
[{"$f":"CONCATENATE(\"COMUNA: \",NOMBRE!$B$2,\" - \",\"( \",NOMBRE!$C$2,NOMBRE!$D$2,NOMBRE!$E$2,NOMBRE!$F$2,NOMBRE!$G$2,\" )\")","v":"COMUNA:  - (  )"}]
[{"$f":"CONCATENATE(\"ESTABLECIMIENTO/ESTRATEGIA: \",NOMBRE!$B$3,\" - \",\"( \",NOMBRE!$C$3,NOMBRE!$D$3,NOMBRE!$E$3,NOMBRE!$F$3,NOMBRE!$G$3,NOMBRE!$H$3,\" )\")","v":"ESTABLECIMIENTO/ESTRATEGIA:  - (  )"}]
[{"$f":"CONCATENATE(\"MES: \",NOMBRE!$B$6,\" - \",\"( \",NOMBRE!$C$6,NOMBRE!$D$6,\" )\")","v":"MES:  - (  )"}]
[{"$f":"CONCATENATE(\"AÑO: \",NOMBRE!$B$7)","v":"AÑO: 2024"}]
[]
["REM-P7. FAMILIAS EN CONTROL DE SALUD FAMILIAR"]
["SECCIÓN A. CLASIFICACIÓN DE LAS FAMILIAS SECTOR URBANO"]
["CLASIFICACIÓN DE LAS FAMILIAS POR SECTOR","TOTAL","SECTOR 1","SECTOR 2","SECTOR 3","SECTOR 4","SECTOR 5","SECTOR 6","SECTOR 7","SECTOR 8"]
["N° FAMILIAS INSCRITAS ",{"$f":"SUM(C10:J10)","v":0}]
["N° FAMILIAS EVALUADAS CON CARTOLA/ENCUESTA FAMILIAR",{"$f":"SUM(C11:J11)","v":0}]
["N° DE FAMILIAS EN RIESGO BAJO",{"$f":"SUM(C12:J12)","v":0}]
["N° DE FAMILIAS EN RIESGO MEDIO",{"$f":"SUM(C13:J13)","v":0}]
["N° DE FAMILIAS EN RIESGO ALTO",{"$f":"SUM(C14:J14)","v":0}]
["SECCIÓN A.1 CLASIFICACIÓN DE LAS FAMILIAS SECTOR RURAL"]
["CLASIFICACIÓN DE LAS FAMILIAS POR SECTOR","TOTAL","SECTOR 1","SECTOR 2","SECTOR 3","SECTOR 4","SECTOR 5","SECTOR 6","SECTOR 7","SECTOR 8"]
["N° FAMILIAS INSCRITAS ",{"$f":"SUM(C17:J17)","v":0}]
["N° FAMILIAS EVALUADAS CON CARTOLA/ENCUESTA FAMILIAR",{"$f":"SUM(C18:J18)","v":0}]
["N° DE FAMILIAS EN RIESGO BAJO",{"$f":"SUM(C19:J19)","v":0}]
["N° DE FAMILIAS EN RIESGO MEDIO",{"$f":"SUM(C20:J20)","v":0}]
["N° DE FAMILIAS EN RIESGO ALTO",{"$f":"SUM(C21:J21)","v":0}]
["SECCIÓN B. INTERVENCIÓN EN FAMILIAS SECTOR URBANO Y RURAL"]
["INTERVENCIÓN EN FAMILIAS",null,null,"TOTAL","SECTOR 1","SECTOR 2","SECTOR 3","SECTOR 4","SECTOR 5","SECTOR 6","SECTOR 7","SECTOR 8"]
["N° FAMILIAS CON PLAN DE INTERVENCIÓN",null,null,{"$f":"SUM(E24:L24)","v":0}]
["N° FAMILIAS SIN PLAN DE INTERVENCIÓN","RIESGO BAJO",null,0]
[null,"RIESGO MEDIO",null,0]
[null,"RIESGO ALTO",null,0]
["N° FAMILIAS EGRESADAS DE PLANES DE INTERVENCIÓN","TOTAL DE EGRESOS",null,0]
[null,"ALTA POR CUMPLIR PLAN DE INTERVENCIÓN",null,0]
[null,"TRASLADO DE ESTABLECIMIENTO",null,0]
[null,"DERIVACIÓN POR COMPLEJIDAD DEL CASO",null,{"$f":"SUM(E31:L31)","v":0}]
[null,"POR ABANDONO",null,{"$f":"SUM(E32:L32)","v":0}]
[]
[]
[]
[]
[]
[]
[]
[]
[]
[]
[]
[]
[]
[]
[]
[]
[{"$f":"SUM(B10:B14,B17:B21,D24:D32)","v":0},"datos"]
[{"$f":"SUM(0)","v":0},"errores"]

{"sheet":"P9","index":8,"n_rows":106,"n_cols":63,"rows_kept":106,"cut":false,"hidden":false,"merged":[[9,42,9,43],[9,44,9,45],[9,38,9,39],[9,40,9,41],[82,11,83,13],[52,11,54,13],[6,2,6,16],[41,2,43,4],[52,2,54,4],[67,2,69,4],[67,14,69,16],[52,14,54,16],[41,14,43,16],[41,11,43,13],[9,14,9,16],[9,11,9,13],[9,8,9,10],[9,5,9,7],[41,8,43,10],[67,5,69,7],[67,8,69,10],[67,11,69,13],[52,5,54,7],[52,8,54,10],[62,0,62,1],[65,0,65,1],[63,0,63,1],[64,0,64,1],[97,0,98,0],[82,0,84,0],[82,1,84,1],[91,0,92,0],[93,0,94,0],[89,0,90,0],[85,0,86,0],[87,0,88,0],[50,0,50,1],[45,0,45,1],[46,0,46,1],[47,0,47,1],[95,0,96,0],[67,0,70,1],[77,0,77,1],[78,0,78,1],[57,0,57,1],[41,0,44,1],[41,5,43,7],[82,8,83,10],[82,2,83,4],[82,5,83,7],[52,0,55,1],[48,0,48,1],[75,0,75,1],[76,0,76,1],[79,0,79,1],[80,0,80,1],[71,0,71,1],[72,0,72,1],[73,0,73,1],[74,0,74,1],[49,0,49,1],[11,0,11,1],[9,0,10,1],[9,2,9,4],[20,0,26,0],[31,0,39,0],[12,0,19,0],[27,0,30,0]]}
["DATOS DEL ESTABLECIMIENTO"]
[{"$f":"CONCATENATE(\"COMUNA: \",NOMBRE!$B$2,\" - \",\"( \",NOMBRE!$C$2,NOMBRE!$D$2,NOMBRE!$E$2,NOMBRE!$F$2,NOMBRE!$G$2,\" )\")","v":"COMUNA:  - (  )"}]
[{"$f":"CONCATENATE(\"ESTABLECIMIENTO/ESTRATEGIA: \",NOMBRE!$B$3,\" - \",\"( \",NOMBRE!$C$3,NOMBRE!$D$3,NOMBRE!$E$3,NOMBRE!$F$3,NOMBRE!$G$3,NOMBRE!$H$3,\" )\")","v":"ESTABLECIMIENTO/ESTRATEGIA:  - (  )"}]
[{"$f":"CONCATENATE(\"MES: \",NOMBRE!$B$6,\" - \",\"( \",NOMBRE!$C$6,NOMBRE!$D$6,\" )\")","v":"MES:  - (  )"}]
[{"$f":"CONCATENATE(\"AÑO: \",NOMBRE!$B$7)","v":"AÑO: 2024"}]
[]
[null,null,"REM-P9. POBLACIÓN EN CONTROL DEL ADOLESCENTE",null,null,null,null,null,null,null,null,null,null,null,null,null,null,{"$f":"AQ7 & AR7 & AS7 & AT7 & AQ6 & AR6 & AS6 & AT6","v":""}]
[]
["SECCION A: POBLACIÓN EN CONTROL DE SALUD INTEGRAL DE ADOLESCENTES, SEGÚN ESTADO NUTRICIONAL"]
["INDICADOR NUTRICIONAL\nY\nPARÁMETROS DE MEDICIÓN",null,"TOTAL",null,null,"Adolescentes 10 a 14 años",null,null,"Adolescentes 15 a 19 años",null,null," Pueblos Originarios",null,null," Migrantes",null,null,null,null,null,null,null,null,null,null,null,null,null,null,null,null,null,null,null,null,null,null,null,"Pueblos originarios",null,"Poblacion Migrantes",null,"Pueblos originarios",null,"Poblacion Migrantes"]
[null,null,"Ambos\nsexos","Hombres","Mujeres","Ambos\nsexos","Hombres","Mujeres","Ambos\nsexos","Hombres","Mujeres","Ambos\nsexos","Hombres","Mujeres","Ambos\nsexos","Hombres","Mujeres",null,null,null,null,null,null,null,null,null,null,null,null,null,null,null,null,null,null,null,null,null,"No Olvide Hombres","No Olvide Mujeres","No Olvide Hombres","No Olvide Mujeres","Hombres","Mujeres","Hombres","Mujeres"]
["TOTAL ADOLESCENTES EN CONTROL",null,{"$f":"SUM(D12:E12)","v":0},{"$f":"+G12+J12","v":0},{"$f":"+H12+K12","v":0},{"$f":"SUM(G12:H12)","v":0},null,null,{"$f":"SUM(J12:K12)","v":0},null,null,{"$f":"SUM(M12:N12)","v":0},null,null,{"$f":"SUM(P12:Q12)","v":0},null,null,{"$f":"AM12&AN12&AO12&AP12&AQ12 & AR12 & AS12 & AT12","v":""},null,null,null,null,null,null,null,null,null,null,null,null,null,null,null,null,null,null,null,null,{"$f":"IF(AND(D12<>0,M12=\"\"),\"* No olvide escribir en la celda de Pueblos Originarios Hombres (Digite CERO si no tiene).  \",\"\")","v":""},{"$f":"IF(AND(E12<>0,N12=\"\"),\"* No olvide escribir en la celda de Pueblos Originarios Mujeres (Digite CERO si no tiene).  \",\"\")","v":""},{"$f":"IF(AND($D12<>0,$P12=\"\"),\"* No olvide escribir en la celda de Población Migrantes Hombres (Digite CERO si no tiene). \",\"\")","v":""},{"$f":"IF(AND($E12<>0,$Q12=\"\"),\"* No olvide escribir en la celda de Población Migrantes Mujeres (Digite CERO si no tiene). \",\"\")","v":""},{"$f":"IF(($M12)>$D12,\"* La celda Pueblos Originarios Hombres debe ser menor o igual al Total Hombres. \",\"\")","v":""},{"$f":"IF($N12>$E12,\"* La celda Pueblos Originarios Mujeres debe ser menor o igual al Total Mujeres . \",\"\")","v":""},{"$f":"IF(($P12)>$D12,\"* La celda Población Migrantes Hombres debe ser menor o igual al Total Hombres. \",\"\")","v":""},{"$f":"IF($Q12>$E12,\"* La celda Población Migrantes Mujeres debe ser menor o igual al Total Mujeres. \",\"\")","v":""},null,null,null,null,null,{"$f":"IF($D12<$M12, 1,0)","v":0},{"$f":"IF($E12<$N12, 1,0)","v":0},{"$f":"IF($D12<$P12, 1,0)","v":0},{"$f":"IF($E12<$Q12, 1,0)","v":0},{"$f":"IF(AND(D12<>0,M12=\"\"),1,0)","v":0},{"$f":"IF(AND(E12<>0,N12=\"\"),1,0)","v":0},{"$f":"IF(AND(D12<>0,P12=\"\"),1,0)","v":0},{"$f":"IF(AND(E12<>0,Q12=\"\"),1,0)","v":0}]
["INDICADOR IMC / EDAD",">+ 3 D.E. (Obesidad Severa)",{"$f":"SUM(D13:E13)","v":0},{"$f":"+G13+J13","v":0},{"$f":"+H13+K13","v":0},{"$f":"SUM(G13:H13)","v":0},null,null,{"$f":"SUM(J13:K13)","v":0},null,null,{"$f":"SUM(M13:N13)","v":0},null,null,{"$f":"SUM(P13:Q13)","v":0},null,null,{"$f":"AM13&AN13&AO13&AP13&AQ13 & AR13 & AS13 & AT13","v":""},null,null,null,null,null,null,null,null,null,null,null,null,null,null,null,null,null,null,null,null,{"$f":"IF(AND(D13<>0,M13=\"\"),\"* No olvide escribir en la celda de Pueblos Originarios Hombres (Digite CERO si no tiene).  \",\"\")","v":""},{"$f":"IF(AND(E13<>0,N13=\"\"),\"* No olvide escribir en la celda de Pueblos Originarios Mujeres (Digite CERO si no tiene).  \",\"\")","v":""},{"$f":"IF(AND($D13<>0,$P13=\"\"),\"* No olvide escribir en la celda de Población Migrantes Hombres (Digite CERO si no tiene). \",\"\")","v":""},{"$f":"IF(AND($E13<>0,$Q13=\"\"),\"* No olvide escribir en la celda de Población Migrantes Mujeres (Digite CERO si no tiene). \",\"\")","v":""},{"$f":"IF(($M13)>$D13,\"* La celda Pueblos Originarios Hombres debe ser menor o igual al Total Hombres. \",\"\")","v":""},{"$f":"IF($N13>$E13,\"* La celda Pueblos Originarios Mujeres debe ser menor o igual al Total Mujeres . \",\"\")","v":""},{"$f":"IF(($P13)>$D13,\"* La celda Población Migrantes Hombres debe ser menor o igual al Total Hombres. \",\"\")","v":""},{"$f":"IF($Q13>$E13,\"* La celda Población Migrantes Mujeres debe ser menor o igual al Total Mujeres. \",\"\")","v":""},null,null,null,null,null,{"$f":"IF($D13<$M13, 1,0)","v":0},{"$f":"IF($E13<$N13, 1,0)","v":0},{"$f":"IF($D13<$P13, 1,0)","v":0},{"$f":"IF($E13<$Q13, 1,0)","v":0},{"$f":"IF(AND(D13<>0,M13=\"\"),1,0)","v":0},{"$f":"IF(AND(E13<>0,N13=\"\"),1,0)","v":0},{"$f":"IF(AND(D13<>0,P13=\"\"),1,0)","v":0},{"$f":"IF(AND(E13<>0,Q13=\"\"),1,0)","v":0}]
[null,"≥ +2.0 a+2,9 D.E. (Obesidad)",0,0,{"$f":"+H14+K14","v":0},{"$f":"SUM(G14:H14)","v":0},null,null,{"$f":"SUM(J14:K14)","v":0},null,null,{"$f":"SUM(M14:N14)","v":0},null,null,{"$f":"SUM(P14:Q14)","v":0},null,null,"",null,null,null,null,null,null,null,null,null,null,null,null,null,null,null,null,null,null,null,null,"","","","","","","","",null,null,null,null,null,0,0,0,0,0,0,0,0]
[null,"≥ +1.0 a+1,9 D.E.(Sobrepeso) ",0,0,0,{"$f":"SUM(G15:H15)","v":0},null,null,{"$f":"SUM(J15:K15)","v":0},null,null,{"$f":"SUM(M15:N15)","v":0},null,null,{"$f":"SUM(P15:Q15)","v":0},null,null,"",null,null,null,null,null,null,null,null,null,null,null,null,null,null,null,null,null,null,null,null,"","","","","","","","",null,null,null,null,null,0,0,0,0,0,0,0,0]
[null,"SUBTOTAL",0,{"$f":"+G16+J16","v":0},0,{"$f":"SUM(F13:F15)","v":0},{"$f":"SUM(G13:G15)","v":0},{"$f":"SUM(H13:H15)","v":0},{"$f":"SUM(I13:I15)","v":0},{"$f":"SUM(J13:J15)","v":0},0,{"$f":"SUM(L13:L15)","v":0},0,0,0,0,0]
[null,"≤ -1.0 a-1,9 D.E.(Bajo peso)",0,0,0,{"$f":"SUM(G17:H17)","v":0},null,null,{"$f":"SUM(J17:K17)","v":0},null,null,{"$f":"SUM(M17:N17)","v":0},null,null,{"$f":"SUM(P17:Q17)","v":0},null,null,{"$f":"AM17&AN17&AO17&AP17&AQ17 & AR17 & AS17 & AT17","v":""},null,null,null,null,null,null,null,null,null,null,null,null,null,null,null,null,null,null,null,null,{"$f":"IF(AND(D17<>0,M17=\"\"),\"* No olvide escribir en la celda de Pueblos Originarios Hombres (Digite CERO si no tiene).  \",\"\")","v":""},{"$f":"IF(AND(E17<>0,N17=\"\"),\"* No olvide escribir en la celda de Pueblos Originarios Mujeres (Digite CERO si no tiene).  \",\"\")","v":""},{"$f":"IF(AND($D17<>0,$P17=\"\"),\"* No olvide escribir en la celda de Población Migrantes Hombres (Digite CERO si no tiene). \",\"\")","v":""},{"$f":"IF(AND($E17<>0,$Q17=\"\"),\"* No olvide escribir en la celda de Población Migrantes Mujeres (Digite CERO si no tiene). \",\"\")","v":""},{"$f":"IF(($M17)>$D17,\"* La celda Pueblos Originarios Hombres debe ser menor o igual al Total Hombres. \",\"\")","v":""},{"$f":"IF($N17>$E17,\"* La celda Pueblos Originarios Mujeres debe ser menor o igual al Total Mujeres . \",\"\")","v":""},{"$f":"IF(($P17)>$D17,\"* La celda Población Migrantes Hombres debe ser menor o igual al Total Hombres. \",\"\")","v":""},{"$f":"IF($Q17>$E17,\"* La celda Población Migrantes Mujeres debe ser menor o igual al Total Mujeres. \",\"\")","v":""},null,null,null,null,null,{"$f":"IF($D17<$M17, 1,0)","v":0},{"$f":"IF($E17<$N17, 1,0)","v":0},{"$f":"IF($D17<$P17, 1,0)","v":0},{"$f":"IF($E17<$Q17, 1,0)","v":0},{"$f":"IF(AND(D17<>0,M17=\"\"),1,0)","v":0},{"$f":"IF(AND(E17<>0,N17=\"\"),1,0)","v":0},{"$f":"IF(AND(D17<>0,P17=\"\"),1,0)","v":0},{"$f":"IF(AND(E17<>0,Q17=\"\"),1,0)","v":0}]
[null,"≤ -2.0 D.E. (Desnutrición)",0,0,0,{"$f":"SUM(G18:H18)","v":0},null,null,{"$f":"SUM(J18:K18)","v":0},null,null,{"$f":"SUM(M18:N18)","v":0},null,null,{"$f":"SUM(P18:Q18)","v":0},null,null,"",null,null,null,null,null,null,null,null,null,null,null,null,null,null,null,null,null,null,null,null,"","","","","","","","",null,null,null,null,null,0,0,0,0,0,0,0,0]
[null,"SUBTOTAL",0,0,0,{"$f":"SUM(F17:F18)","v":0},{"$f":"SUM(G17:G18)","v":0},{"$f":"SUM(H17:H18)","v":0},0,0,0,{"$f":"SUM(L17:L18)","v":0},0,0,0,0,0]
[null," -0.9 a+ 0.9 D.E. (Peso Normal)",0,{"$f":"+G20+J20","v":0},0,{"$f":"SUM(G20:H20)","v":0},null,null,{"$f":"SUM(J20:K20)","v":0},null,null,{"$f":"SUM(M20:N20)","v":0},null,null,{"$f":"SUM(P20:Q20)","v":0},null,null,"",null,null,null,null,null,null,null,null,null,null,null,null,null,null,null,null,null,null,null,null,{"$f":"IF(AND(D20<>0,M20=\"\"),\"* No olvide escribir en la celda de Pueblos Originarios Hombres (Digite CERO si no tiene).  \",\"\")","v":""},{"$f":"IF(AND(E20<>0,N20=\"\"),\"* No olvide escribir en la celda de Pueblos Originarios Mujeres (Digite CERO si no tiene).  \",\"\")","v":""},{"$f":"IF(AND($D20<>0,$P20=\"\"),\"* No olvide escribir en la celda de Población Migrantes Hombres (Digite CERO si no tiene). \",\"\")","v":""},{"$f":"IF(AND($E20<>0,$Q20=\"\"),\"* No olvide escribir en la celda de Población Migrantes Mujeres (Digite CERO si no tiene). \",\"\")","v":""},{"$f":"IF(($M20)>$D20,\"* La celda Pueblos Originarios Hombres debe ser menor o igual al Total Hombres. \",\"\")","v":""},{"$f":"IF($N20>$E20,\"* La celda Pueblos Originarios Mujeres debe ser menor o igual al Total Mujeres . \",\"\")","v":""},{"$f":"IF(($P20)>$D20,\"* La celda Población Migrantes Hombres debe ser menor o igual al Total Hombres. \",\"\")","v":""},{"$f":"IF($Q20>$E20,\"* La celda Población Migrantes Mujeres debe ser menor o igual al Total Mujeres. \",\"\")","v":""},null,null,null,null,null,{"$f":"IF($D20<$M20, 1,0)","v":0},{"$f":"IF($E20<$N20, 1,0)","v":0},{"$f":"IF($D20<$P20, 1,0)","v":0},{"$f":"IF($E20<$Q20, 1,0)","v":0},{"$f":"IF(AND(D20<>0,M20=\"\"),1,0)","v":0},{"$f":"IF(AND(E20<>0,N20=\"\"),1,0)","v":0},{"$f":"IF(AND(D20<>0,P20=\"\"),1,0)","v":0},{"$f":"IF(AND(E20<>0,Q20=\"\"),1,0)","v":0}]
["INDICADOR TALLA/EDAD","≥+ 2.0 D.E.(Talla Alta)",0,{"$f":"+G21+J21","v":0},0,{"$f":"SUM(G21:H21)","v":0},null,null,{"$f":"SUM(J21:K21)","v":0},null,null,{"$f":"SUM(M21:N21)","v":0},null,null,{"$f":"SUM(P21:Q21)","v":0},null,null,"",null,null,null,null,null,null,null,null,null,null,null,null,null,null,null,null,null,null,null,null,"","","","","","","","",null,null,null,null,null,0,0,0,0,0,0,0,0]
[null,"+ 1.0 a+ 1.9 D.E. (Talla Normal Alta)",0,0,0,{"$f":"SUM(G22:H22)","v":0},null,null,{"$f":"SUM(J22:K22)","v":0},null,null,{"$f":"SUM(M22:N22)","v":0},null,null,{"$f":"SUM(P22:Q22)","v":0},null,null,"",null,null,null,null,null,null,null,null,null,null,null,null,null,null,null,null,null,null,null,null,"","","","","","","","",null,null,null,null,null,0,0,0,0,0,0,0,0]
[null,"SUBTOTAL",0,0,0,{"$f":"SUM(F21:F22)","v":0},{"$f":"SUM(G21:G22)","v":0},{"$f":"SUM(H21:H22)","v":0},{"$f":"SUM(I21:I22)","v":0},0,0,{"$f":"SUM(L21:L22)","v":0},0,0,{"$f":"SUM(O21:O22)","v":0},0,0]
[null,"- 1.0 a -1.9 D.E. (Talla Normal Baja)",0,0,0,{"$f":"SUM(G24:H24)","v":0},null,null,{"$f":"SUM(J24:K24)","v":0},null,null,{"$f":"SUM(M24:N24)","v":0},null,null,{"$f":"SUM(P24:Q24)","v":0},null,null,"",null,null,null,null,null,null,null,null,null,null,null,null,null,null,null,null,null,null,null,null,{"$f":"IF(AND(D24<>0,M24=\"\"),\"* No olvide escribir en la celda de Pueblos Originarios Hombres (Digite CERO si no tiene).  \",\"\")","v":""},{"$f":"IF(AND(E24<>0,N24=\"\"),\"* No olvide escribir en la celda de Pueblos Originarios Mujeres (Digite CERO si no tiene).  \",\"\")","v":""},{"$f":"IF(AND($D24<>0,$P24=\"\"),\"* No olvide escribir en la celda de Población Migrantes Hombres (Digite CERO si no tiene). \",\"\")","v":""},{"$f":"IF(AND($E24<>0,$Q24=\"\"),\"* No olvide escribir en la celda de Población Migrantes Mujeres (Digite CERO si no tiene). \",\"\")","v":""},{"$f":"IF(($M24)>$D24,\"* La celda Pueblos Originarios Hombres debe ser menor o igual al Total Hombres. \",\"\")","v":""},{"$f":"IF($N24>$E24,\"* La celda Pueblos Originarios Mujeres debe ser menor o igual al Total Mujeres . \",\"\")","v":""},{"$f":"IF(($P24)>$D24,\"* La celda Población Migrantes Hombres debe ser menor o igual al Total Hombres. \",\"\")","v":""},{"$f":"IF($Q24>$E24,\"* La celda Población Migrantes Mujeres debe ser menor o igual al Total Mujeres. \",\"\")","v":""},null,null,null,null,null,{"$f":"IF($D24<$M24, 1,0)","v":0},{"$f":"IF($E24<$N24, 1,0)","v":0},{"$f":"IF($D24<$P24, 1,0)","v":0},{"$f":"IF($E24<$Q24, 1,0)","v":0},{"$f":"IF(AND(D24<>0,M24=\"\"),1,0)","v":0},{"$f":"IF(AND(E24<>0,N24=\"\"),1,0)","v":0},{"$f":"IF(AND(D24<>0,P24=\"\"),1,0)","v":0},{"$f":"IF(AND(E24<>0,Q24=\"\"),1,0)","v":0}]
[null,"< 2 D.E. (Talla Baja)",0,0,0,{"$f":"SUM(G25:H25)","v":0},null,null,{"$f":"SUM(J25:K25)","v":0},null,null,{"$f":"SUM(M25:N25)","v":0},null,null,{"$f":"SUM(P25:Q25)","v":0},null,null,"",null,null,null,null,null,null,null,null,null,null,null,null,null,null,null,null,null,null,null,null,"","","","","","","","",null,null,null,null,null,0,0,0,0,0,0,0,0]
[null,"SUBTOTAL",0,0,0,{"$f":"SUM(F24:F25)","v":0},{"$f":"SUM(G24:G25)","v":0},0,{"$f":"SUM(I24:I25)","v":0},0,0,0,0,0,{"$f":"SUM(O24:O25)","v":0},0,0]
[null,"-0.9 a+ 0.9 D.E. (Talla Normal)",0,0,{"$f":"+H27+K27","v":0},{"$f":"SUM(G27:H27)","v":0},null,null,{"$f":"SUM(J27:K27)","v":0},null,null,{"$f":"SUM(M27:N27)","v":0},null,null,{"$f":"SUM(P27:Q27)","v":0},null,null,"",null,null,null,null,null,null,null,null,null,null,null,null,null,null,null,null,null,null,null,null,{"$f":"IF(AND(D27<>0,M27=\"\"),\"* No olvide escribir en la celda de Pueblos Originarios Hombres (Digite CERO si no tiene).  \",\"\")","v":""},{"$f":"IF(AND(E27<>0,N27=\"\"),\"* No olvide escribir en la celda de Pueblos Originarios Mujeres (Digite CERO si no tiene).  \",\"\")","v":""},{"$f":"IF(AND($D27<>0,$P27=\"\"),\"* No olvide escribir en la celda de Población Migrantes Hombres (Digite CERO si no tiene). \",\"\")","v":""},{"$f":"IF(AND($E27<>0,$Q27=\"\"),\"* No olvide escribir en la celda de Población Migrantes Mujeres (Digite CERO si no tiene). \",\"\")","v":""},{"$f":"IF(($M27)>$D27,\"* La celda Pueblos Originarios Hombres debe ser menor o igual al Total Hombres. \",\"\")","v":""},{"$f":"IF($N27>$E27,\"* La celda Pueblos Originarios Mujeres debe ser menor o igual al Total Mujeres . \",\"\")","v":""},{"$f":"IF(($P27)>$D27,\"* La celda Población Migrantes Hombres debe ser menor o igual al Total Hombres. \",\"\")","v":""},{"$f":"IF($Q27>$E27,\"* La celda Población Migrantes Mujeres debe ser menor o igual al Total Mujeres. \",\"\")","v":""},null,null,null,null,null,{"$f":"IF($D27<$M27, 1,0)","v":0},{"$f":"IF($E27<$N27, 1,0)","v":0},{"$f":"IF($D27<$P27, 1,0)","v":0},{"$f":"IF($E27<$Q27, 1,0)","v":0},{"$f":"IF(AND(D27<>0,M27=\"\"),1,0)","v":0},{"$f":"IF(AND(E27<>0,N27=\"\"),1,0)","v":0},{"$f":"IF(AND(D27<>0,P27=\"\"),1,0)","v":0},{"$f":"IF(AND(E27<>0,Q27=\"\"),1,0)","v":0}]
["RANGOS PERCENTILARES PARA CIRCUNFERENCIA DE CINTURA","NORMAL (p<75)",0,0,0,{"$f":"SUM(G28:H28)","v":0},null,null,{"$f":"SUM(J28:K28)","v":0},null,null,{"$f":"SUM(M28:N28)","v":0},null,null,{"$f":"SUM(P28:Q28)","v":0},null,null,"",null,null,null,null,null,null,null,null,null,null,null,null,null,null,null,null,null,null,null,null,"","","","","","","","",null,null,null,null,null,0,0,0,0,0,0,0,0]
[null,"RIESGO DE OBESIDAD (p75<p<90)",0,0,0,{"$f":"SUM(G29:H29)","v":0},null,null,{"$f":"SUM(J29:K29)","v":0},null,null,{"$f":"SUM(M29:N29)","v":0},null,null,{"$f":"SUM(P29:Q29)","v":0},null,null,"",null,null,null,null,null,null,null,null,null,null,null,null,null,null,null,null,null,null,null,null,"","","","","","","","",null,null,null,null,null,0,0,0,0,0,0,0,0]
[null,"OBESIDAD ABDOMINAL p>90)",0,0,0,{"$f":"SUM(G30:H30)","v":0},null,null,{"$f":"SUM(J30:K30)","v":0},null,null,{"$f":"SUM(M30:N30)","v":0},null,null,{"$f":"SUM(P30:Q30)","v":0},null,null,"",null,null,null,null,null,null,null,null,null,null,null,null,null,null,null,null,null,null,null,null,"","","","","","","","",null,null,null,null,null,0,0,0,0,0,0,0,0]
[null,"TOTAL",0,0,0,{"$f":"SUM(F28:F30)","v":0},{"$f":"SUM(G28:G30)","v":0},0,{"$f":"SUM(I28:I30)","v":0},0,0,{"$f":"SUM(L28:L30)","v":0},0,0,{"$f":"SUM(O28:O30)","v":0},0,0]
["DIAGNOSTICO NUTRICIONAL INTEGRADO","DEFICIT PONDERADO BAJO PESO",0,{"$f":"+G32+J32","v":0},{"$f":"+H32+K32","v":0},{"$f":"SUM(G32:H32)","v":0},null,null,{"$f":"SUM(J32:K32)","v":0},null,null,{"$f":"SUM(M32:N32)","v":0},null,null,{"$f":"SUM(P32:Q32)","v":0},null,null,{"$f":"AM32&AN32&AO32&AP32&AQ32 & AR32 & AS32 & AT32","v":""},null,null,null,null,null,null,null,null,null,null,null,null,null,null,null,null,null,null,null,null,{"$f":"IF(AND(D32<>0,M32=\"\"),\"* No olvide escribir en la celda de Pueblos Originarios Hombres (Digite CERO si no tiene).  \",\"\")","v":""},{"$f":"IF(AND(E32<>0,N32=\"\"),\"* No olvide escribir en la celda de Pueblos Originarios Mujeres (Digite CERO si no tiene).  \",\"\")","v":""},{"$f":"IF(AND($D32<>0,$P32=\"\"),\"* No olvide escribir en la celda de Población Migrantes Hombres (Digite CERO si no tiene). \",\"\")","v":""},{"$f":"IF(AND($E32<>0,$Q32=\"\"),\"* No olvide escribir en la celda de Población Migrantes Mujeres (Digite CERO si no tiene). \",\"\")","v":""},{"$f":"IF(($M32)>$D32,\"* La celda Pueblos Originarios Hombres debe ser menor o igual al Total Hombres. \",\"\")","v":""},{"$f":"IF($N32>$E32,\"* La celda Pueblos Originarios Mujeres debe ser menor o igual al Total Mujeres . \",\"\")","v":""},{"$f":"IF(($P32)>$D32,\"* La celda Población Migrantes Hombres debe ser menor o igual al Total Hombres. \",\"\")","v":""},{"$f":"IF($Q32>$E32,\"* La celda Población Migrantes Mujeres debe ser menor o igual al Total Mujeres. \",\"\")","v":""},null,null,null,null,null,{"$f":"IF($D32<$M32, 1,0)","v":0},{"$f":"IF($E32<$N32, 1,0)","v":0},{"$f":"IF($D32<$P32, 1,0)","v":0},{"$f":"IF($E32<$Q32, 1,0)","v":0},{"$f":"IF(AND(D32<>0,M32=\"\"),1,0)","v":0},{"$f":"IF(AND(E32<>0,N32=\"\"),1,0)","v":0},{"$f":"IF(AND(D32<>0,P32=\"\"),1,0)","v":0},{"$f":"IF(AND(E32<>0,Q32=\"\"),1,0)","v":0}]
[null,"DESNUTRIDO",0,0,0,0,null,null,0,null,null,0,null,null,0,null,null,"",null,null,null,null,null,null,null,null,null,null,null,null,null,null,null,null,null,null,null,null,"","","","","","","","",null,null,null,null,null,0,0,0,0,0,0,0,0]
[null,"SOBREPESO / RIESGO OBESIDAD",0,0,0,0,null,null,0,null,null,0,null,null,0,null,null,"",null,null,null,null,null,null,null,null,null,null,null,null,null,null,null,null,null,null,null,null,"","","","","","","","",null,null,null,null,null,0,0,0,0,0,0,0,0]
[null,"OBESO",0,0,0,0,null,null,0,null,null,0,null,null,0,null,null,"",null,null,null,null,null,null,null,null,null,null,null,null,null,null,null,null,null,null,null,null,"","","","","","","","",null,null,null,null,null,0,0,0,0,0,0,0,0]
[null,"OBESO SEVERO",0,0,0,0,null,null,0,null,null,0,null,null,0,null,null,"",null,null,null,null,null,null,null,null,null,null,null,null,null,null,null,null,null,null,null,null,"","","","","","","","",null,null,null,null,null,0,0,0,0,0,0,0,0]
[null,"NORMAL O EUTROFIA",0,{"$f":"+G37+J37","v":0},0,0,null,null,0,null,null,0,null,null,0,null,null,"",null,null,null,null,null,null,null,null,null,null,null,null,null,null,null,null,null,null,null,null,"","","","","","","","",null,null,null,null,null,0,0,0,0,0,0,0,0]
[null,"SUBTOTAL",0,{"$f":"+G38+J38","v":0},0,{"$f":"SUM(F32:F37)","v":0},{"$f":"SUM(G32:G37)","v":0},0,{"$f":"SUM(I32:I37)","v":0},{"$f":"SUM(J32:J37)","v":0},0,0,{"$f":"SUM(M32:M37)","v":0},{"$f":"SUM(N32:N37)","v":0},{"$f":"SUM(O32:O37)","v":0},0,0]
[null,"DESNUTRICIÓN \nSECUNDARIA",0,{"$f":"+G39+J39","v":0},0,{"$f":"SUM(G39:H39)","v":0},null,null,{"$f":"SUM(J39:K39)","v":0},null,null,{"$f":"SUM(M39:N39)","v":0},null,null,{"$f":"SUM(P39:Q39)","v":0},null,null,"",null,null,null,null,null,null,null,null,null,null,null,null,null,null,null,null,null,null,null,null,{"$f":"IF(AND(D39<>0,M39=\"\"),\"* No olvide escribir en la celda de Pueblos Originarios Hombres (Digite CERO si no tiene).  \",\"\")","v":""},{"$f":"IF(AND(E39<>0,N39=\"\"),\"* No olvide escribir en la celda de Pueblos Originarios Mujeres (Digite CERO si no tiene).  \",\"\")","v":""},{"$f":"IF(AND($D39<>0,$P39=\"\"),\"* No olvide escribir en la celda de Población Migrantes Hombres (Digite CERO si no tiene). \",\"\")","v":""},{"$f":"IF(AND($E39<>0,$Q39=\"\"),\"* No olvide escribir en la celda de Población Migrantes Mujeres (Digite CERO si no tiene). \",\"\")","v":""},{"$f":"IF(($M39)>$D39,\"* La celda Pueblos Originarios Hombres debe ser menor o igual al Total Hombres. \",\"\")","v":""},{"$f":"IF($N39>$E39,\"* La celda Pueblos Originarios Mujeres debe ser menor o igual al Total Mujeres . \",\"\")","v":""},{"$f":"IF(($P39)>$D39,\"* La celda Población Migrantes Hombres debe ser menor o igual al Total Hombres. \",\"\")","v":""},{"$f":"IF($Q39>$E39,\"* La celda Población Migrantes Mujeres debe ser menor o igual al Total Mujeres. \",\"\")","v":""},null,null,null,null,null,{"$f":"IF($D39<$M39, 1,0)","v":0},{"$f":"IF($E39<$N39, 1,0)","v":0},{"$f":"IF($D39<$P39, 1,0)","v":0},{"$f":"IF($E39<$Q39, 1,0)","v":0},{"$f":"IF(AND(D39<>0,M39=\"\"),1,0)","v":0},{"$f":"IF(AND(E39<>0,N39=\"\"),1,0)","v":0},{"$f":"IF(AND(D39<>0,P39=\"\"),1,0)","v":0},{"$f":"IF(AND(E39<>0,Q39=\"\"),1,0)","v":0}]
[null,"T O T A L",{"$f":"SUM(C32:C37)+C39","v":0},{"$f":"SUM(D32:D37)+D39","v":0},0,0,{"$f":"SUM(G32:G37)+G39","v":0},0,0,{"$f":"SUM(J32:J37)+J39","v":0},0,0,0,0,0,0,0]
["SECCION B: POBLACIÓN EN CONTROL SALUD INTEGRAL DE ADOLESCENTES, SEGÚN EDUCACIÓN Y TRABAJO"]
["Estudio/trabajo",null,"TOTAL",null,null,"Adolescentes 10-14 años",null,null,"Adolescentes 15 - 19 años",null,null," Pueblos Originarios",null,null," Migrantes"]
[]
[]
[null,null,"Ambos sexos","Hombre","Mujer","Ambos sexos","Hombre","Mujer","Ambos sexos","Hombre","Mujer","Ambos sexos","Hombre","Mujer","Ambos sexos","Hombre","Mujer"]
["ESTUDIA",null,{"$f":"SUM(D46:E46)","v":0},{"$f":"+G46+J46","v":0},{"$f":"+H46+K46","v":0},{"$f":"SUM(G46:H46)","v":0},null,null,{"$f":"SUM(J46:K46)","v":0},null,null,{"$f":"SUM(M46:N46)","v":0},null,null,{"$f":"SUM(P46:Q46)","v":0},null,null,{"$f":"$AP46 &AM46&AN46&AO46& AQ46 & AR46 & AS46 & AT46","v":""},null,null,null,null,null,null,null,null,null,null,null,null,null,null,null,null,null,null,null,null,{"$f":"IF(AND(D46<>0,M46=\"\"),\"* No olvide escribir en la celda de Pueblos Originarios Hombres (Digite CERO si no tiene).  \",\"\")","v":""},{"$f":"IF(AND(E46<>0,N46=\"\"),\"* No olvide escribir en la celda de Pueblos Originarios Mujeres (Digite CERO si no tiene).  \",\"\")","v":""},{"$f":"IF(AND($D46<>0,$P46=\"\"),\"* No olvide escribir en la celda de Población Migrantes Hombres (Digite CERO si no tiene). \",\"\")","v":""},{"$f":"IF(AND($E46<>0,$Q46=\"\"),\"* No olvide escribir en la celda de Población Migrantes Mujeres (Digite CERO si no tiene). \",\"\")","v":""},{"$f":"IF(($M46)>$D46,\"* La celda Pueblos Originarios Hombres debe ser menor o igual al Total Hombres. \",\"\")","v":""},{"$f":"IF($N46>$E46,\"* La celda Pueblos Originarios Mujeres debe ser menor o igual al Total Mujeres . \",\"\")","v":""},{"$f":"IF(($P46)>$D46,\"* La celda Población Migrantes Hombres debe ser menor o igual al Total Hombres. \",\"\")","v":""},{"$f":"IF($Q46>$E46,\"* La celda Población Migrantes Mujeres debe ser menor o igual al Total Mujeres. \",\"\")","v":""},null,null,null,null,null,{"$f":"IF($D46<$M46, 1,0)","v":0},{"$f":"IF($E46<$N46, 1,0)","v":0},{"$f":"IF($D46<$P46, 1,0)","v":0},{"$f":"IF($E46<$Q46, 1,0)","v":0},{"$f":"IF(AND(D46<>0,M46=\"\"),1,0)","v":0},{"$f":"IF(AND(E46<>0,N46=\"\"),1,0)","v":0},{"$f":"IF(AND(D46<>0,P46=\"\"),1,0)","v":0},{"$f":"IF(AND(E46<>0,Q46=\"\"),1,0)","v":0}]
["DESERCIÓN ESCOLAR",null,0,{"$f":"+G47+J47","v":0},{"$f":"+H47+K47","v":0},0,null,null,0,null,null,0,null,null,0,null,null,{"$f":"$AP47 &AM47&AN47&AO47& AQ47 & AR47 & AS47 & AT47","v":""},null,null,null,null,null,null,null,null,null,null,null,null,null,null,null,null,null,null,null,null,"","","","","","","","",null,null,null,null,null,0,0,0,0,0,0,0,0]
["TRABAJO INFANTIL",null,0,{"$f":"+G48","v":0},{"$f":"+H48","v":0},0,null,null,{"$f":"SUM(J48:K48)","v":0},null,null,0,null,null,0,null,null,"",null,null,null,null,null,null,null,null,null,null,null,null,null,null,null,null,null,null,null,null,"","","","","","","","",null,null,null,null,null,0,0,0,0,0,0,0,0]
["TRABAJO JUVENIL",null,{"$f":"SUM(D49:E49)","v":0},{"$f":"+J49","v":0},{"$f":"+K49","v":0},{"$f":"SUM(G49:H49)","v":0},null,null,0,null,null,0,null,null,0,null,null,"",null,null,null,null,null,null,null,null,null,null,null,null,null,null,null,null,null,null,null,null,"","","","","","","","",null,null,null,null,null,0,0,0,0,0,0,0,0]
["PEORES FORMAS DE TRABAJO INFANTIL",null,0,0,0,0,null,null,0,null,null,0,null,null,0,null,null,"",null,null,null,null,null,null,null,null,null,null,null,null,null,null,null,null,null,null,null,null,"","","","","","","","",null,null,null,null,null,0,0,0,0,0,0,0,0]
["SERVICIO DOMESTICO NO REMUNERADO PELIGROSO",null,0,0,0,0,null,null,0,null,null,0,null,null,0,null,null,"",null,null,null,null,null,null,null,null,null,null,null,null,null,null,null,null,null,null,null,null,"","","","","","","","",null,null,null,null,null,0,0,0,0,0,0,0,0]
["SECCION C: POBLACIÓN EN CONTROL SALUD INTEGRAL DE ADOLESCENTES, SEGÚN ÁREAS DE RIESGO"]
["Áreas de Riesgo",null,"TOTAL",null,null,"Adolescentes 10-14 años",null,null,"Adolescentes 15 - 19 años",null,null,"Pueblos Originarios",null,null,"Migrantes"]
[]
[]
[null,null,"Ambos sexos","Hombre","Mujer","Ambos sexos","Hombre","Mujer","Ambos sexos","Hombre","Mujer","Ambos sexos","Hombre","Mujer","Ambos sexos","Hombre","Mujer"]
["RIESGO SSR",null,{"$f":"SUM(D57:E57)","v":0},{"$f":"+G57+J57","v":0},{"$f":"+H57+K57","v":0},{"$f":"SUM(G57:H57)","v":0},null,null,{"$f":"SUM(J57:K57)","v":0},null,null,{"$f":"SUM(M57:N57)","v":0},null,null,{"$f":"SUM(P57:Q57)","v":0},null,null,{"$f":"AM57&AN57&AO57&AP57& AQ57 & AR57 & AS57 & AT57","v":""},null,null,null,null,null,null,null,null,null,null,null,null,null,null,null,null,null,null,null,null,{"$f":"IF(AND(D57<>0,M57=\"\"),\"* No olvide escribir en la celda de Pueblos Originarios Hombres (Digite CERO si no tiene).  \",\"\")","v":""},{"$f":"IF(AND(E57<>0,N57=\"\"),\"* No olvide escribir en la celda de Pueblos Originarios Mujeres (Digite CERO si no tiene).  \",\"\")","v":""},{"$f":"IF(AND($D57<>0,$P57=\"\"),\"* No olvide escribir en la celda de Población Migrantes Hombres (Digite CERO si no tiene). \",\"\")","v":""},{"$f":"IF(AND($E57<>0,$Q57=\"\"),\"* No olvide escribir en la celda de Población Migrantes Mujeres (Digite CERO si no tiene). \",\"\")","v":""},{"$f":"IF(($M57)>$D57,\"* La celda Pueblos Originarios Hombres debe ser menor o igual al Total Hombres. \",\"\")","v":""},{"$f":"IF($N57>$E57,\"* La celda Pueblos Originarios Mujeres debe ser menor o igual al Total Mujeres . \",\"\")","v":""},{"$f":"IF(($P57)>$D57,\"* La celda Población Migrantes Hombres debe ser menor o igual al Total Hombres. \",\"\")","v":""},{"$f":"IF($Q57>$E57,\"* La celda Población Migrantes Mujeres debe ser menor o igual al Total Mujeres. \",\"\")","v":""},null,null,null,null,null,{"$f":"IF($D57<$M57, 1,0)","v":0},{"$f":"IF($E57<$N57, 1,0)","v":0},{"$f":"IF($D57<$P57, 1,0)","v":0},{"$f":"IF($E57<$Q57, 1,0)","v":0},{"$f":"IF(AND(D57<>0,M57=\"\"),1,0)","v":0},{"$f":"IF(AND(E57<>0,N57=\"\"),1,0)","v":0},{"$f":"IF(AND(D57<>0,P57=\"\"),1,0)","v":0},{"$f":"IF(AND(E57<>0,Q57=\"\"),1,0)","v":0}]
["RIESGO SUICIDA",null,0,{"$f":"+G58+J58","v":0},{"$f":"+H58+K58","v":0},0,null,null,0,null,null,0,null,null,0,null,null,{"$f":"AM58&AN58&AO58&AP58& AQ58 & AR58 & AS58 & AT58","v":""},null,null,null,null,null,null,null,null,null,null,null,null,null,null,null,null,null,null,null,null,"","","","","","","","",null,null,null,null,null,0,0,0,0,0,0,0,0]
["RIESGO SOCIAL",null,0,0,0,0,null,null,0,null,null,0,null,null,0,null,null,"",null,null,null,null,null,null,null,null,null,null,null,null,null,null,null,null,null,null,null,null,"","","","","","","","",null,null,null,null,null,0,0,0,0,0,0,0,0]
["RIESGO PSICOEMOCIONAL",null,0,0,0,0,null,null,{"$f":"SUM(J60:K60)","v":0},null,null,0,null,null,0,null,null,"",null,null,null,null,null,null,null,null,null,null,null,null,null,null,null,null,null,null,null,null,"","","","","","","","",null,null,null,null,null,0,0,0,0,0,0,0,0]
["VIOLENCIA",null,{"$f":"SUM(D61:E61)","v":0},{"$f":"+G61+J61","v":0},{"$f":"+H61+K61","v":0},{"$f":"SUM(G61:H61)","v":0},null,null,{"$f":"SUM(J61:K61)","v":0},null,null,{"$f":"SUM(M61:N61)","v":0},null,null,{"$f":"SUM(P61:Q61)","v":0},null,null,"",null,null,null,null,null,null,null,null,null,null,null,null,null,null,null,null,null,null,null,null,"","","","","","","","",null,null,null,null,null,0,0,0,0,0,0,0,0]
["RIESGO OH/DROGAS",null,0,0,0,0,null,null,0,null,null,0,null,null,0,null,null,"",null,null,null,null,null,null,null,null,null,null,null,null,null,null,null,null,null,null,null,null,"","","","","","","","",null,null,null,null,null,0,0,0,0,0,0,0,0]
["MALNUTRICION POR DEFICIT",null,0,0,0,0,null,null,0,null,null,0,null,null,0,null,null,"",null,null,null,null,null,null,null,null,null,null,null,null,null,null,null,null,null,null,null,null,"","","","","","","","",null,null,null,null,null,0,0,0,0,0,0,0,0]
["MALNUTRICION POR EXCESO",null,0,0,0,0,null,null,0,null,null,0,null,null,0,null,null,"",null,null,null,null,null,null,null,null,null,null,null,null,null,null,null,null,null,null,null,null,"","","","","","","","",null,null,null,null,null,0,0,0,0,0,0,0,0]
["RIESGO DESERCIÓN ESCOLAR",null,0,{"$f":"+G65+J65","v":0},0,0,null,null,0,null,null,0,null,null,0,null,null,"",null,null,null,null,null,null,null,null,null,null,null,null,null,null,null,null,null,null,null,null,"","","","","","","","",null,null,null,null,null,0,0,0,0,0,0,0,0]
["OTRO",null,0,0,0,0,null,null,0,null,null,0,null,null,0,null,null,"",null,null,null,null,null,null,null,null,null,null,null,null,null,null,null,null,null,null,null,null,"","","","","","","","",null,null,null,null,null,0,0,0,0,0,0,0,0]
["SECCION D: POBLACIÓN EN CONTROL SALUD INTEGRAL DE ADOLESCENTES, SEGÚN AMBITOS GINECO-UROLOGICO/SEXUALIDAD"]
["Gineco/urologico/sexualidad",null,"TOTAL",null,null,"Adolescentes 10-14 años",null,null,"Adolescentes 15 - 19 años",null,null," Pueblos Originarios",null,null," Migrantes"]
[]
[]
[null,null,"Ambos sexos","Hombre","Mujer","Ambos sexos","Hombre","Mujer","Ambos sexos","Hombre","Mujer","Ambos sexos","Hombre","Mujer","Ambos sexos","Hombre","Mujer"]
["ADOLESCENTES CON CONDUCTA POSTERGADORA",null,{"$f":"SUM(D72:E72)","v":0},{"$f":"+G72+J72","v":0},{"$f":"+H72+K72","v":0},{"$f":"SUM(G72:H72)","v":0},null,null,{"$f":"SUM(J72:K72)","v":0},null,null,{"$f":"SUM(M72:N72)","v":0},null,null,{"$f":"SUM(P72:Q72)","v":0},null,null,{"$f":"$AM72&AN72&AO72&AP72 & AQ72 & AR72 & AS72 & AT72","v":""},null,null,null,null,null,null,null,null,null,null,null,null,null,null,null,null,null,null,null,null,{"$f":"IF(AND(D72<>0,M72=\"\"),\"* No olvide escribir en la celda de Pueblos Originarios Hombres (Digite CERO si no tiene).  \",\"\")","v":""},{"$f":"IF(AND(E72<>0,N72=\"\"),\"* No olvide escribir en la celda de Pueblos Originarios Mujeres (Digite CERO si no tiene).  \",\"\")","v":""},{"$f":"IF(AND($D72<>0,$P72=\"\"),\"* No olvide escribir en la celda de Población Migrantes Hombres (Digite CERO si no tiene). \",\"\")","v":""},{"$f":"IF(AND($E72<>0,$Q72=\"\"),\"* No olvide escribir en la celda de Población Migrantes Mujeres (Digite CERO si no tiene). \",\"\")","v":""},{"$f":"IF(($M72)>$D72,\"* La celda Pueblos Originarios Hombres debe ser menor o igual al Total Hombres. \",\"\")","v":""},{"$f":"IF($N72>$E72,\"* La celda Pueblos Originarios Mujeres debe ser menor o igual al Total Mujeres . \",\"\")","v":""},{"$f":"IF(($P72)>$D72,\"* La celda Población Migrantes Hombres debe ser menor o igual al Total Hombres. \",\"\")","v":""},{"$f":"IF($Q72>$E72,\"* La celda Población Migrantes Mujeres debe ser menor o igual al Total Mujeres. \",\"\")","v":""},null,null,null,null,null,{"$f":"IF($D72<$M72, 1,0)","v":0},{"$f":"IF($E72<$N72, 1,0)","v":0},{"$f":"IF($D72<$P72, 1,0)","v":0},{"$f":"IF($E72<$Q72, 1,0)","v":0},{"$f":"IF(AND(D72<>0,M72=\"\"),1,0)","v":0},{"$f":"IF(AND(E72<>0,N72=\"\"),1,0)","v":0},{"$f":"IF(AND(D72<>0,P72=\"\"),1,0)","v":0},{"$f":"IF(AND(E72<>0,Q72=\"\"),1,0)","v":0}]
["ADOLESCENTES CON CONDUCTA ANTICIPADORA",null,{"$f":"SUM(D73:E73)","v":0},{"$f":"+G73+J73","v":0},{"$f":"+H73+K73","v":0},{"$f":"SUM(G73:H73)","v":0},null,null,{"$f":"SUM(J73:K73)","v":0},null,null,{"$f":"SUM(M73:N73)","v":0},null,null,{"$f":"SUM(P73:Q73)","v":0},null,null,{"$f":"$AM73&AN73&AO73&AP73 & AQ73 & AR73 & AS73 & AT73","v":""},null,null,null,null,null,null,null,null,null,null,null,null,null,null,null,null,null,null,null,null,"","","","","","","","",null,null,null,null,null,0,0,0,0,0,0,0,0]
["ADOLESCENTES CON CONDUCTA ACTIVA",null,0,0,0,0,null,null,0,null,null,0,null,null,0,null,null,"",null,null,null,null,null,null,null,null,null,null,null,null,null,null,null,null,null,null,null,null,"","","","","","","","",null,null,null,null,null,0,0,0,0,0,0,0,0]
["USO ACTUAL DE METODO ANTICONCEPTIVO",null,0,0,0,0,null,null,0,null,null,0,null,null,0,null,null,"",null,null,null,null,null,null,null,null,null,null,null,null,null,null,null,null,null,null,null,null,"","","","","","","","",null,null,null,null,null,0,0,0,0,0,0,0,0]
["USO ACTUAL DE DOBLE PROTECCIÓN",null,0,0,0,0,null,null,0,null,null,0,null,null,0,null,null,"",null,null,null,null,null,null,null,null,null,null,null,null,null,null,null,null,null,null,null,null,"","","","","","","","",null,null,null,null,null,0,0,0,0,0,0,0,0]
["ADOLESCENTE CON ANTECEDENTE DE UN PRIMER EMBARAZO",null,{"$f":"SUM(D77:E77)","v":0},{"$f":"+G77+J77","v":0},0,0,null,null,0,null,null,0,null,null,0,null,null,"",null,null,null,null,null,null,null,null,null,null,null,null,null,null,null,null,null,null,null,null,"","","","","","","","",null,null,null,null,null,0,0,0,0,0,0,0,0]
["ADOLESCENTE CON ANTECEDENTE DE MAS DE UN EMBARAZO",null,{"$f":"SUM(D78:E78)","v":0},{"$f":"+G78+J78","v":0},{"$f":"+H78+K78","v":0},{"$f":"SUM(G78:H78)","v":0},null,null,{"$f":"SUM(J78:K78)","v":0},null,null,{"$f":"SUM(M78:N78)","v":0},null,null,{"$f":"SUM(P78:Q78)","v":0},null,null,"",null,null,null,null,null,null,null,null,null,null,null,null,null,null,null,null,null,null,null,null,"","","","","","","","",null,null,null,null,null,0,0,0,0,0,0,0,0]
["ADOLESCENTE CON ANTECEDENTE DE ABORTO",null,0,0,0,0,null,null,0,null,null,0,null,null,0,null,null,"",null,null,null,null,null,null,null,null,null,null,null,null,null,null,null,null,null,null,null,null,"","","","","","","","",null,null,null,null,null,0,0,0,0,0,0,0,0]
["ADOLESCENTE QUE PRESENTA VIOLENCIA DE PAREJA/POLOLO",null,0,0,0,0,null,null,0,null,null,0,null,null,0,null,null,"",null,null,null,null,null,null,null,null,null,null,null,null,null,null,null,null,null,null,null,null,"","","","","","","","",null,null,null,null,null,0,0,0,0,0,0,0,0]
["ADOLESCENTE QUE PRESENTA O HA SIDO VICTIMA DE VIOLENCIA SEXUAL",null,0,0,0,0,null,null,0,null,null,0,null,null,0,null,null,{"$f":"$AM81&AN81&AO81&AP81 & AQ81 & AR81 & AS81 & AT81","v":""},null,null,null,null,null,null,null,null,null,null,null,null,null,null,null,null,null,null,null,null,"","","","","","","","",null,null,null,null,null,0,0,0,0,0,0,0,0]
["SECCION E: POBLACIÓN ADOLESCENTE QUE RECIBE CONSEJERÍA"]
["ACTIVIDAD Y AREA TEMATICA","Grupos de Edad","Total de Adolescentes que reciben Consejería",null,null," Pueblos Originarios",null,null," Migrantes",null,null,"Espacios Amigables"]
[]
[null,null,"Ambos sexos","Hombre","Mujer","Ambos sexos","Hombre","Mujer","Ambos sexos","Hombre","Mujer","Ambos sexos","Hombre","Mujer"]
["ACTIVIDAD FÍSICA","10-14 años",{"$f":"SUM(D86:E86)","v":0},null,null,{"$f":"SUM(G86:H86)","v":0},null,null,{"$f":"SUM(J86:K86)","v":0},null,null,{"$f":"SUM(M86:N86)","v":0},null,null,{"$f":"$AM86&AN86&AO86 & AP86 & AQ86&AR86&AS86 & AT86 & AU86 & AV86&AW86&AX86","v":""},null,null,null,null,null,null,null,null,null,null,null,null,null,null,null,null,null,null,null,null,null,null,null,{"$f":"IF(AND(D86<>0,M86=\"\"),\"* No olvide escribir en la celda de Pueblos Originarios Hombres (Digite CERO si no tiene).  \",\"\")","v":""},{"$f":"IF(AND(E86<>0,N86=\"\"),\"* No olvide escribir en la celda de Pueblos Originarios Mujeres (Digite CERO si no tiene).  \",\"\")","v":""},{"$f":"IF(AND($D86<>0,$P86=\"\"),\"* No olvide escribir en la celda de Población Migrantes Hombres (Digite CERO si no tiene). \",\"\")","v":""},{"$f":"IF(AND($E86<>0,$K86=\"\"),\"* No olvide escribir en la celda de Población Migrantes Mujeres (Digite CERO si no tiene). \",\"\")","v":""},{"$f":"IF(AND($D86<>0,$M86=\"\"),\"* No olvide escribir en la celda Espacios Amigables Hombre (Digite CERO si no tiene). \",\"\")","v":""},{"$f":"IF(AND($E86<>0,$N86=\"\"),\"* No olvide escribir en la celda Espacios Amigables Mujer (Digite CERO si no tiene). \",\"\")","v":""},{"$f":"IF(($G86)>$D86,\"* La celda Pueblos Originarios Hombre debe ser menor o igual al Total Hombre. \",\"\")","v":""},{"$f":"IF($H86>$E86,\"* La celda Pueblos Originarios Mujer debe ser menor o igual al Total Mujer. \",\"\")","v":""},{"$f":"IF(($J86)>$D86,\"* La celda Población Migrantes Hombre debe ser menor o igual al Total Hombres. \",\"\")","v":""},{"$f":"IF($K86>$E86,\"* La celda Población Migrantes Mujer debe ser menor o igual al Total Mujer. \",\"\")","v":""},{"$f":"IF($M86>$D86,\"* La celda Espacios Amigables Hombre debe ser menor o igual al Total Hombres. \",\"\")","v":""},{"$f":"IF($N86>$E86,\"* La celda Espacios Amigables Mujer debe ser menor o igual al Total Mujeres. \",\"\")","v":""},null,{"$f":"IF($D86<$G86, 1,0)","v":0},{"$f":"IF($E86<$H86, 1,0)","v":0},{"$f":"IF($D86<$J86, 1,0)","v":0},{"$f":"IF($E86<$K86, 1,0)","v":0},{"$f":"IF($D86<$M86, 1,0)","v":0},{"$f":"IF($E86<$N86, 1,0)","v":0},{"$f":"IF(AND(D86<>0,G86=\"\"),1,0)","v":0},{"$f":"IF(AND(E86<>0,H86=\"\"),1,0)","v":0},{"$f":"IF(AND(D86<>0,J86=\"\"),1,0)","v":0},{"$f":"IF(AND(E86<>0,K86=\"\"),1,0)","v":0},{"$f":"IF(AND(D86<>0,M86=\"\"),1,0)","v":0},{"$f":"IF(AND(E86<>0,N86=\"\"),1,0)","v":0}]
[null,"15 - 19 años",{"$f":"SUM(D87:E87)","v":0},null,null,{"$f":"SUM(G87:H87)","v":0},null,null,{"$f":"SUM(J87:K87)","v":0},null,null,{"$f":"SUM(M87:N87)","v":0},null,null,{"$f":"AM87&AN87&AO87 & AP87 & AQ87&AR87&AS87 & AT87 & AU87 & AV87&AW87&AX87","v":""},null,null,null,null,null,null,null,null,null,null,null,null,null,null,null,null,null,null,null,null,null,null,null,"","","",{"$f":"IF(AND($E87<>0,$K87=\"\"),\"* No olvide escribir en la celda de Población Migrantes Mujeres (Digite CERO si no tiene). \",\"\")","v":""},{"$f":"IF(AND($D87<>0,$M87=\"\"),\"* No olvide escribir en la celda Espacios Amigables Hombre (Digite CERO si no tiene). \",\"\")","v":""},{"$f":"IF(AND($E87<>0,$N87=\"\"),\"* No olvide escribir en la celda Espacios Amigables Mujer (Digite CERO si no tiene). \",\"\")","v":""},{"$f":"IF(($G87)>$D87,\"* La celda Pueblos Originarios Hombre debe ser menor o igual al Total Hombre. \",\"\")","v":""},{"$f":"IF($H87>$E87,\"* La celda Pueblos Originarios Mujer debe ser menor o igual al Total Mujer. \",\"\")","v":""},{"$f":"IF(($J87)>$D87,\"* La celda Población Migrantes Hombre debe ser menor o igual al Total Hombres. \",\"\")","v":""},{"$f":"IF($K87>$E87,\"* La celda Población Migrantes Mujer debe ser menor o igual al Total Mujer. \",\"\")","v":""},{"$f":"IF($M87>$D87,\"* La celda Espacios Amigables Hombre debe ser menor o igual al Total Hombres. \",\"\")","v":""},{"$f":"IF($N87>$E87,\"* La celda Espacios Amigables Mujer debe ser menor o igual al Total Mujeres. \",\"\")","v":""},null,{"$f":"IF($D87<$G87, 1,0)","v":0},{"$f":"IF($E87<$H87, 1,0)","v":0},{"$f":"IF($D87<$J87, 1,0)","v":0},{"$f":"IF($E87<$K87, 1,0)","v":0},{"$f":"IF($D87<$M87, 1,0)","v":0},{"$f":"IF($E87<$N87, 1,0)","v":0},{"$f":"IF(AND(D87<>0,G87=\"\"),1,0)","v":0},{"$f":"IF(AND(E87<>0,H87=\"\"),1,0)","v":0},{"$f":"IF(AND(D87<>0,J87=\"\"),1,0)","v":0},{"$f":"IF(AND(E87<>0,K87=\"\"),1,0)","v":0},{"$f":"IF(AND(D87<>0,M87=\"\"),1,0)","v":0},{"$f":"IF(AND(E87<>0,N87=\"\"),1,0)","v":0}]
["ALIMENTACION SALUDABLE","10-14 años",{"$f":"SUM(D88:E88)","v":0},null,null,0,null,null,0,null,null,0,null,null,"",null,null,null,null,null,null,null,null,null,null,null,null,null,null,null,null,null,null,null,null,null,null,null,"","","","","","","","","","","","",null,0,0,0,0,0,0,0,0,0,0,0,0]
[null,"15 - 19 años",0,null,null,0,null,null,0,null,null,{"$f":"SUM(M89:N89)","v":0},null,null,"",null,null,null,null,null,null,null,null,null,null,null,null,null,null,null,null,null,null,null,null,null,null,null,"","","","","","","","","","","","",null,0,0,0,0,0,0,0,0,0,0,0,0]
["TABAQUISMO","10-14 años",0,null,null,0,null,null,0,null,null,0,null,null,"",null,null,null,null,null,null,null,null,null,null,null,null,null,null,null,null,null,null,null,null,null,null,null,"","","","","","","","","","","","",null,0,0,0,0,0,0,0,0,0,0,0,0]
[null,"15 - 19 años",0,null,null,0,null,null,0,null,null,0,null,null,"",null,null,null,null,null,null,null,null,null,null,null,null,null,null,null,null,null,null,null,null,null,null,null,"","","","","","","","","","","","",null,0,0,0,0,0,0,0,0,0,0,0,0]
["CONSUMO DE DROGAS","10-14 años",0,null,null,0,null,null,0,null,null,0,null,null,"",null,null,null,null,null,null,null,null,null,null,null,null,null,null,null,null,null,null,null,null,null,null,null,"","","","","","","","","","","","",null,0,0,0,0,0,0,0,0,0,0,0,0]
[null,"15 - 19 años",0,null,null,0,null,null,0,null,null,0,null,null,"",null,null,null,null,null,null,null,null,null,null,null,null,null,null,null,null,null,null,null,null,null,null,null,"","","","","","","","","","","","",null,0,0,0,0,0,0,0,0,0,0,0,0]
["SALUD SEXUAL REPRODUCTIVA","10-14 años",0,null,null,0,null,null,0,null,null,0,null,null,"",null,null,null,null,null,null,null,null,null,null,null,null,null,null,null,null,null,null,null,null,null,null,null,"","","","","","","","","","","","",null,0,0,0,0,0,0,0,0,0,0,0,0]
[null,"15 - 19 años",0,null,null,0,null,null,0,null,null,0,null,null,"",null,null,null,null,null,null,null,null,null,null,null,null,null,null,null,null,null,null,null,null,null,null,null,"","","","","","","","","","","","",null,0,0,0,0,0,0,0,0,0,0,0,0]
["REGULACION DE FECUNDIDAD","10-14 años",0,null,null,0,null,null,0,null,null,0,null,null,"",null,null,null,null,null,null,null,null,null,null,null,null,null,null,null,null,null,null,null,null,null,null,null,"","","","","","","","","","","","",null,0,0,0,0,0,0,0,0,0,0,0,0]
[null,"15 - 19 años",0,null,null,0,null,null,0,null,null,0,null,null,"",null,null,null,null,null,null,null,null,null,null,null,null,null,null,null,null,null,null,null,null,null,null,null,"","","","","","","","","","","","",null,0,0,0,0,{"$f":"IF($D97<$M97, 1,0)","v":0},0,0,0,0,0,0,0]
["PREVENCION VIH-ITS","10-14 años",0,null,null,0,null,null,0,null,null,{"$f":"SUM(M98:N98)","v":0},null,null,"",null,null,null,null,null,null,null,null,null,null,null,null,null,null,null,null,null,null,null,null,null,null,null,"","","","","","","","","","","","",null,0,0,0,0,0,0,0,0,0,0,0,0]
[null,"15 - 19 años",0,null,null,0,null,null,0,null,null,{"$f":"SUM(M99:N99)","v":0},null,null,"",null,null,null,null,null,null,null,null,null,null,null,null,null,null,null,null,null,null,null,null,null,null,null,"","","","","","","","","","","","",null,0,0,0,0,0,0,0,0,0,0,0,0]
[]
[]
[]
[]
[]
[{"$f":"SUM(C12:C39,,I12:I39,L12:L39,O12:O39,C46:C51,F46:F51,I46:I51,L46:L51,O46:O51,C57:C66,L57:L66,O57:O66,F57:F66,I57:I66,C72:C81,F72:F81,I72:I81,L72:L81,O72:O81,C86:C99,F86:F99,I86:I99,L86:L99)","v":0},"datos"]
[{"$f":"SUM(AZ12:BK99)","v":0},"errores"]

{"sheet":"P11","index":9,"n_rows":34,"n_cols":106,"rows_kept":34,"cut":false,"hidden":false,"merged":[[18,97,19,97],[18,98,19,98],[18,99,19,99],[8,92,10,92],[8,93,10,93],[18,85,19,85],[18,86,19,86],[18,91,19,94],[18,95,20,95],[18,96,20,96],[8,48,10,48],[18,80,19,81],[18,82,20,82],[18,83,20,83],[18,84,19,84],[8,49,10,49],[18,0,20,0],[18,1,19,3],[18,4,18,31],[19,4,19,5],[19,6,19,7],[19,10,19,11],[19,12,19,13],[19,14,19,15],[19,8,19,9],[19,18,19,19],[19,22,19,23],[19,30,19,31],[19,20,19,21],[19,16,19,17],[19,24,19,25],[19,26,19,27],[9,22,9,23],[9,20,9,21],[6,0,6,16],[8,6,8,43],[9,36,9,37],[9,14,9,15],[9,16,9,17],[9,38,9,39],[9,34,9,35],[9,26,9,27],[9,32,9,33],[9,28,9,29],[9,30,9,31],[8,3,9,5],[13,1,14,1],[8,47,10,47],[18,35,20,35],[18,34,20,34],[8,46,10,46],[9,42,9,43],[9,40,9,41],[8,44,9,45],[18,32,19,33],[19,28,19,29],[9,6,9,7],[9,8,9,9],[9,10,9,11],[9,12,9,13],[9,24,9,25],[9,18,9,19],[15,0,16,0],[8,98,9,98],[8,83,10,83],[8,94,10,94],[8,97,9,97],[8,79,9,80],[8,81,10,81],[8,82,10,82],[8,85,9,85],[8,96,9,96],[8,87,9,87],[8,86,9,86],[8,90,9,91],[11,0,14,0],[11,1,12,1],[8,0,10,2],[8,100,9,100],[8,88,9,88],[8,84,10,84],[8,89,9,89],[8,95,10,95],[8,99,9,99]]}
["DATOS DEL ESTABLECIMIENTO"]
[{"$f":"CONCATENATE(\"COMUNA: \",NOMBRE!$B$2,\" - \",\"( \",NOMBRE!$C$2,NOMBRE!$D$2,NOMBRE!$E$2,NOMBRE!$F$2,NOMBRE!$G$2,\" )\")","v":"COMUNA:  - (  )"}]
[{"$f":"CONCATENATE(\"ESTABLECIMIENTO/ESTRATEGIA: \",NOMBRE!$B$3,\" - \",\"( \",NOMBRE!$C$3,NOMBRE!$D$3,NOMBRE!$E$3,NOMBRE!$F$3,NOMBRE!$G$3,NOMBRE!$H$3,\" )\")","v":"ESTABLECIMIENTO/ESTRATEGIA:  - (  )"}]
[{"$f":"CONCATENATE(\"MES: \",NOMBRE!$B$6,\" - \",\"( \",NOMBRE!$C$6,NOMBRE!$D$6,\" )\")","v":"MES:  - (  )"}]
[{"$f":"CONCATENATE(\"AÑO: \",NOMBRE!$B$7)","v":"AÑO: 2024"}]
[]
["REM-P11. POBLACIÓN EN CONTROL PROGRAMA DE INFECCIONES DE TRASMISIÓN SEXUAL - VIH / SIDA"]
["SECCION A: POBLACIÓN EN CONTROL DEL PROGRAMA DE VIH/SIDA (Uso exclusivo Centros de Atención VIH-SIDA)"]
["CONCEPTO",null,null,"TOTAL",null,null,"GRUPO DE EDAD (en años) Y SEXO",null,null,null,null,null,null,null,null,null,null,null,null,null,null,null,null,null,null,null,null,null,null,null,null,null,null,null,null,null,null,null,null,null,null,null,null,null,"TRANS",null,"Pueblos Originarios","Migrantes","Niños, Niñas, Adolescentes y Jóvenes SENAME","Niños, Niñas, Adolescentes y Jóvenes Mejor Niñez",null,null,null,null,null,null,null,null,null,null,null,null,null,null,null,null,null,null,null,null,null,null,null,null,null,null,null,null,null,"TRANS",null,"Pueblos Originarios","Población Migrantes","Población SENAME","Población Mejor Niñez",null,"Pueblos Originarios","Población Migrantes","Población SENAME","Población Mejor Niñez","TRANS",null,"Pueblos Originarios","Población Migrantes","Población SENAME","Población Mejor Niñez",null,"Pueblos Originarios","Población Migrantes","Población SENAME","Población Mejor Niñez"]
[null,null,null,null,null,null,"Menor 1 Año",null,"1 año",null,"2 a 4 años",null,"5 a 9 años",null,"10 a 14 años",null,"15 a 19 años",null,"20 a 24 años",null,"25 a 29 años",null,"30 a 34 años",null,"35 a 39 años",null,"40 a 44 años",null,"45 a 49 años",null,"50 a 54 años",null,"55 a 59 años",null,"60 a 64 años",null,"65 a 69 años",null,"70 a 74 años",null,"75 a 79 años",null,"80 y más años"]
[null,null,null,"Ambos\nsexos","Hombres","Mujeres","Hombres ","Mujeres","Hombres ","Mujeres","Hombres ","Mujeres","Hombres ","Mujeres","Hombres ","Mujeres","Hombres ","Mujeres","Hombres ","Mujeres","Hombres ","Mujeres","Hombres ","Mujeres","Hombres ","Mujeres","Hombres ","Mujeres","Hombres ","Mujeres","Hombres ","Mujeres","Hombres ","Mujeres","Hombres ","Mujeres","Hombres ","Mujeres","Hombres ","Mujeres","Hombres ","Mujeres","Hombres ","Mujeres","Masculino","Femenino",null,null,null,null,null,null,null,null,null,null,null,null,null,null,null,null,null,null,null,null,null,null,null,null,null,null,null,null,null,null,null,null,null,"Masculino","Femenino (NO)",null,null,null,null,null,"No Olvide","No Olvide","No Olvide","No Olvide","Masculino","Femenino (NO)",null,null,null,null,null,"No Olvide","No Olvide","No Olvide","No Olvide"]
["Nº TOTAL DE PERSONAS CON VIH/SIDA","GESTANTES","Inicia TARV en este embarazo",{"$f":"SUM(F12)","v":0},null,{"$f":"+P12+R12+T12+V12+X12+Z12+AB12+AD12+AF12+AH12","v":0},null,null,null,null,null,null,null,null,null,null,null,null,null,null,null,null,null,null,null,null,null,null,null,null,null,null,null,null,null,null,null,null,null,null,null,null,null,null,null,null,null,null,null,null,{"$f":"CA12&CB12&CC12&CD12&CE12&CF12&CG12&CH12&CI12&CJ12&CK12&CL12","v":""},null,null,null,null,null,null,null,null,null,null,null,null,null,null,null,null,null,null,null,null,null,null,null,null,null,null,null,null,{"$f":"IF(AND(F12>0,OR(AS12=\"\")),\" * No olvide digitar la variable Trans Masculino. (Digite Cero si no tiene).\",IF(AS12>F12,\" * La variable Trans Masculino no debe ser mayor al Total Mujeres.\",\"\"))","v":""},null,{"$f":"IF($AU12<=$F12,\"\",\"* La celda de 'Pueblos Originarios' no debe ser mayor al Total. \")","v":""},{"$f":"IF($AV12<=$F12,\"\",\"* La celda de 'Población Migrantes' no debe ser mayor al Total. \")","v":""},{"$f":"IF($AW12<=$F12,\"\",\"* La celda de 'Población SENAME' no debe ser mayor al Total. \")","v":""},{"$f":"IF($AX12<=$F12,\"\",\"* La celda de 'Población Mejor Niñez' no debe ser mayor al Total. \")","v":""},null,{"$f":"IF(AND($F12<>0,$AU12=\"\"),\"* No olvide escribir en la celda de Pueblos Originarios (Digite CERO si no tiene). \",\"\")","v":""},{"$f":"IF(AND($F12<>0,$AV12=\"\"),\"* No olvide escribir en la celda de Población Migrantes (Digite CERO si no tiene). \",\"\")","v":""},{"$f":"IF(AND($F12<>0,$AW12=\"\"),\"* No olvide escribir en la celda de Población SENAME (Digite CERO si no tiene). \",\"\")","v":""},{"$f":"IF(AND($D12<>0,$AX12=\"\"),\"* No olvide escribir en la celda de Población Mejor Niñez (Digite CERO si no tiene). \",\"\")","v":""},{"$f":"IF(AND(F12>0,OR(AS12=\"\")),1,IF((AS12)>F12,1,0))","v":0},null,{"$f":"IF($AU12<=$F12,0,1)","v":0},{"$f":"IF($AV12<=$F12,0,1)","v":0},{"$f":"IF($AW12<=$F12,0,1)","v":0},{"$f":"IF($AX12<=$F12,0,1)","v":0},null,{"$f":"IF(AND($F12<>0,$AU12=\"\"),1,0)","v":0},{"$f":"IF(AND($F12<>0,$AV12=\"\"),1,0)","v":0},{"$f":"IF(AND($F12<>0,$AW12=\"\"),1,0)","v":0},{"$f":"IF(AND($D12<>0,$AX12=\"\"),1,0)","v":0}]
[null,null,"en TARV previa",{"$f":"SUM(F13)","v":0},null,{"$f":"+P13+R13+T13+V13+X13+Z13+AB13+AD13+AF13+AH13","v":0},null,null,null,null,null,null,null,null,null,null,null,null,null,null,null,null,null,null,null,null,null,null,null,null,null,null,null,null,null,null,null,null,null,null,null,null,null,null,null,null,null,null,null,null,{"$f":"CA13&CB13&CC13&CD13&CE13&CF13&CG13&CH13&CI13&CJ13&CK13&CL13","v":""},null,null,null,null,null,null,null,null,null,null,null,null,null,null,null,null,null,null,null,null,null,null,null,null,null,null,null,null,{"$f":"IF(AND(F13>0,OR(AS13=\"\")),\" * No olvide digitar la variable Trans Masculino. (Digite Cero si no tiene).\",IF(AS13>F13,\" * La variable Trans Masculino no debe ser mayor al Total Mujeres.\",\"\"))","v":""},null,{"$f":"IF($AU13<=$F13,\"\",\"* La celda de 'Pueblos Originarios' no debe ser mayor al Total. \")","v":""},{"$f":"IF($AV13<=$F13,\"\",\"* La celda de 'Población Migrantes' no debe ser mayor al Total. \")","v":""},{"$f":"IF($AW13<=$F13,\"\",\"* La celda de 'Población SENAME' no debe ser mayor al Total. \")","v":""},{"$f":"IF($AX13<=$F13,\"\",\"* La celda de 'Población Mejor Niñez' no debe ser mayor al Total. \")","v":""},null,{"$f":"IF(AND($F13<>0,$AU13=\"\"),\"* No olvide escribir en la celda de Pueblos Originarios (Digite CERO si no tiene). \",\"\")","v":""},{"$f":"IF(AND($F13<>0,$AV13=\"\"),\"* No olvide escribir en la celda de Población Migrantes (Digite CERO si no tiene). \",\"\")","v":""},{"$f":"IF(AND($F13<>0,$AW13=\"\"),\"* No olvide escribir en la celda de Población SENAME (Digite CERO si no tiene). \",\"\")","v":""},{"$f":"IF(AND($D13<>0,$AX13=\"\"),\"* No olvide escribir en la celda de Población Mejor Niñez (Digite CERO si no tiene). \",\"\")","v":""},{"$f":"IF(AND(F13>0,OR(AS13=\"\")),1,IF((AS13)>F13,1,0))","v":0},null,{"$f":"IF($AU13<=$F13,0,1)","v":0},{"$f":"IF($AV13<=$F13,0,1)","v":0},{"$f":"IF($AW13<=$F13,0,1)","v":0},{"$f":"IF($AX13<=$F13,0,1)","v":0},null,{"$f":"IF(AND($F13<>0,$AU13=\"\"),1,0)","v":0},{"$f":"IF(AND($F13<>0,$AV13=\"\"),1,0)","v":0},{"$f":"IF(AND($F13<>0,$AW13=\"\"),1,0)","v":0},{"$f":"IF(AND($D13<>0,$AX13=\"\"),1,0)","v":0}]
[null,"NO GESTANTES","Con TARV",{"$f":"SUM(E14:F14)","v":0},{"$f":"+G14+I14+K14+M14+O14+Q14+S14+U14+W14+Y14+AA14+AC14+AE14+AG14+AI14+AK14+AM14+AO14+AQ14","v":0},{"$f":"+H14+J14+L14+N14+P14+R14+T14+V14+X14+Z14+AB14+AD14+AF14+AH14+AJ14+AL14+AN14+AP14+AR14","v":0},null,null,null,null,null,null,null,null,null,null,null,null,null,null,null,null,null,null,null,null,null,null,null,null,null,null,null,null,null,null,null,null,null,null,null,null,null,null,null,null,null,null,null,null,{"$f":"CB14&CC14&CD14&CE14&CF14&CG14&CH14&CI14&CJ14&CK14&CL14","v":""},null,null,null,null,null,null,null,null,null,null,null,null,null,null,null,null,null,null,null,null,null,null,null,null,null,null,null,null,"",{"$f":"IF(AND(E14>0,OR(AT14=\"\")),\" * No olvide digitar la variable Trans Femenino (Digite Cero si no tiene).\",IF(AT14>E14,\" * La variable Trans Femenino no debe ser mayor al Total Hombres\",\"\"))","v":""},"","","","",null,{"$f":"IF(AND($D14<>0,$AU14=\"\"),\"* No olvide escribir en la celda de Pueblos Originarios (Digite CERO si no tiene). \",\"\")","v":""},{"$f":"IF(AND($D14<>0,$AV14=\"\"),\"* No olvide escribir en la celda de Población Migrantes (Digite CERO si no tiene). \",\"\")","v":""},{"$f":"IF(AND($D14<>0,$AW14=\"\"),\"* No olvide escribir en la celda de Población SENAME (Digite CERO si no tiene). \",\"\")","v":""},"",0,{"$f":"IF(AND(E14>0,OR(AT14=\"\")),1,IF((AT14)>E14,1,0))","v":0},{"$f":"IF($AU14<=$D14,0,1)","v":0},{"$f":"IF($AV14<=$D14,0,1)","v":0},{"$f":"IF($AW14<=$D14,0,1)","v":0},0,null,{"$f":"IF(AND($D14<>0,$AU14=\"\"),1,0)","v":0},{"$f":"IF(AND($D14<>0,$AV14=\"\"),1,0)","v":0},{"$f":"IF(AND($D14<>0,$AW14=\"\"),1,0)","v":0},0]
[null,null,"Sin TARV",{"$f":"SUM(E15:F15)","v":0},{"$f":"+G15+I15+K15+M15+O15+Q15+S15+U15+W15+Y15+AA15+AC15+AE15+AG15+AI15+AK15+AM15+AO15+AQ15","v":0},{"$f":"+H15+J15+L15+N15+P15+R15+T15+V15+X15+Z15+AB15+AD15+AF15+AH15+AJ15+AL15+AN15+AP15+AR15","v":0},null,null,null,null,null,null,null,null,null,null,null,null,null,null,null,null,null,null,null,null,null,null,null,null,null,null,null,null,null,null,null,null,null,null,null,null,null,null,null,null,null,null,null,null,"",null,null,null,null,null,null,null,null,null,null,null,null,null,null,null,null,null,null,null,null,null,null,null,null,null,null,null,null,"",{"$f":"IF(AND(E15>0,OR(AT15=\"\")),\" * No olvide digitar la variable Trans Femenino (Digite Cero si no tiene).\",IF(AT15>E15,\" * La variable Trans Femenino no debe ser mayor al Total Hombre\",\"\"))","v":""},"","","","",null,{"$f":"IF(AND($D15<>0,$AU15=\"\"),\"* No olvide escribir en la celda de Pueblos Originarios (Digite CERO si no tiene). \",\"\")","v":""},{"$f":"IF(AND($D15<>0,$AV15=\"\"),\"* No olvide escribir en la celda de Población Migrantes (Digite CERO si no tiene). \",\"\")","v":""},{"$f":"IF(AND($D15<>0,$AW15=\"\"),\"* No olvide escribir en la celda de Población SENAME (Digite CERO si no tiene). \",\"\")","v":""},"",0,{"$f":"IF(AND(E15>0,OR(AT15=\"\")),1,IF((AT15)>E15,1,0))","v":0},{"$f":"IF($AU15<=$D15,0,1)","v":0},{"$f":"IF($AV15<=$D15,0,1)","v":0},{"$f":"IF($AW15<=$D15,0,1)","v":0},0,null,{"$f":"IF(AND($D15<>0,$AU15=\"\"),1,0)","v":0},{"$f":"IF(AND($D15<>0,$AV15=\"\"),1,0)","v":0},{"$f":"IF(AND($D15<>0,$AW15=\"\"),1,0)","v":0},0]
["N° DE PERSONAS EN TARV","GESTANTES","Con carga viral <a 1000 copias",{"$f":"SUM(F16)","v":0},null,{"$f":"+P16+R16+T16+V16+X16+Z16+AB16+AD16+AF16+AH16","v":0},null,null,null,null,null,null,null,null,null,null,null,null,null,null,null,null,null,null,null,null,null,null,null,null,null,null,null,null,null,null,null,null,null,null,null,null,null,null,null,null,null,null,null,null,"",null,null,null,null,null,null,null,null,null,null,null,null,null,null,null,null,null,null,null,null,null,null,null,null,null,null,null,null,"",null,"","","","",null,{"$f":"IF(AND($D16<>0,$AU16=\"\"),\"* No olvide escribir en la celda de Pueblos Originarios (Digite CERO si no tiene). \",\"\")","v":""},{"$f":"IF(AND($D16<>0,$AV16=\"\"),\"* No olvide escribir en la celda de Población Migrantes (Digite CERO si no tiene). \",\"\")","v":""},{"$f":"IF(AND($D16<>0,$AW16=\"\"),\"* No olvide escribir en la celda de Población SENAME (Digite CERO si no tiene). \",\"\")","v":""},"",0,null,{"$f":"IF($AU16<=$D16,0,1)","v":0},{"$f":"IF($AV16<=$D16,0,1)","v":0},{"$f":"IF($AW16<=$D16,0,1)","v":0},0,null,{"$f":"IF(AND($D16<>0,$AU16=\"\"),1,0)","v":0},{"$f":"IF(AND($D16<>0,$AV16=\"\"),1,0)","v":0},{"$f":"IF(AND($D16<>0,$AW16=\"\"),1,0)","v":0},0]
[null,"NO GESTANTES","Con carga viral <a 1000 copias",{"$f":"SUM(E17:F17)","v":0},{"$f":"+G17+I17+K17+M17+O17+Q17+S17+U17+W17+Y17+AA17+AC17+AE17+AG17+AI17+AK17+AM17+AO17+AQ17","v":0},{"$f":"+H17+J17+L17+N17+P17+R17+T17+V17+X17+Z17+AB17+AD17+AF17+AH17+AJ17+AL17+AN17+AP17+AR17","v":0},null,null,null,null,null,null,null,null,null,null,null,null,null,null,null,null,null,null,null,null,null,null,null,null,null,null,null,null,null,null,null,null,null,null,null,null,null,null,null,null,null,null,null,null,"",null,null,null,null,null,null,null,null,null,null,null,null,null,null,null,null,null,null,null,null,null,null,null,null,null,null,null,null,"",null,"","","","",null,"","","","",0,null,0,0,0,0,null,0,0,0,0]
["SECCION B: POBLACIÓN EN CONTROL POR COMERCIO SEXUAL (Uso exclusivo de Unidades Control Comercio Sexual)"]
["CONCEPTO","TOTAL",null,null,"GRUPO DE EDAD (en años) Y SEXO",null,null,null,null,null,null,null,null,null,null,null,null,null,null,null,null,null,null,null,null,null,null,null,null,null,null,null,"TRANS",null,"Pueblos Originarios","Migrantes",null,null,null,null,null,null,null,null,null,null,null,null,null,null,null,null,null,null,null,null,null,null,null,null,null,null,null,null,null,null,null,null,null,null,null,null,null,null,null,null,null,null,null,null,"TRANS",null,"Pueblos Originarios","Población Migrantes",null,"Pueblos Originarios","Población Migrantes",null,null,null,null,"TRANS",null,null,null,"Pueblos Originarios","Población Migrantes",null,"Pueblos Originarios","Población Migrantes"]
[null,null,null,null,"15 a 19 años",null,"20 a 24 años",null,"25 a 29 años",null,"30 a 34 años",null,"35 a 39 años",null,"40 a 44 años",null,"45 a 49 años",null,"50 a 54 años",null,"55 a 59 años",null,"60 a 64 años",null,"65 a 69 años",null,"70 a 74 años",null,"75 a 79 años",null,"80 y más años",null,null,null,null,null,null,null,null,null,null,null,null,null,null,null,null,null,null,null,null,null,null,null,null,null,null,null,null,null,null,null,null,null,null,null,null,null,null,null,null,null,null,null,null,null,null,null,null,null,null,null,null,null,null,null,null,null,null,null,null,null,null,null,null,null,null,null,null,null,null,null,null,null,null," "]
[null,"Ambos\nsexos","Hombres","Mujeres","Hombres ","Mujeres","Hombres ","Mujeres","Hombres ","Mujeres","Hombres ","Mujeres","Hombres ","Mujeres","Hombres ","Mujeres","Hombres ","Mujeres","Hombres ","Mujeres","Hombres ","Mujeres","Hombres ","Mujeres","Hombres ","Mujeres","Hombres ","Mujeres","Hombres ","Mujeres","Hombres ","Mujeres","Masculino","Femenino",null,null,null,null,null,null,null,null,null,null,null,null,null,null,null,null,null,null,null,null,null,null,null,null,null,null,null,null,null,null,null,null,null,null,null,null,null,null,null,null,null,null,null,null,null,null,"Masculino","Femenino (NO)",null,null,null,"No Olvide","No Olvide",null,null,null,null,"Masculino",null,null,null,null,null,null,"No Olvide","No Olvide"]
["Nº DE PERSONAS / COMERCIO SEXUAL",{"$f":"SUM(C22:D22)","v":0},{"$f":"+E22+G22+I22+K22+M22+O22+Q22+S22+U22+W22+Y22+AA22+AC22+AE22","v":0},{"$f":"+F22+H22+J22+L22+N22+P22+R22+T22+V22+X22+Z22+AB22+AD22+AF22","v":0},null,null,null,null,null,null,null,null,null,null,null,null,null,null,null,null,null,null,null,null,null,null,null,null,null,null,null,null,null,null,null,null,{"$f":" CC22 & CD22 & CE22 & CF22 & CG22 & CH22 & CI22","v":""},null,null,null,null,null,null,null,null,null,null,null,null,null,null,null,null,null,null,null,null,null,null,null,null,null,null,null,null,null,null,null,null,null,null,null,null,null,null,null,null,null,null,null,{"$f":"IF(AND(D22>0,OR(AG22=\"\")),\" * No olvide digitar la variable Trans Masculino. (Digite Cero si no tiene).\",IF(AG22>D22,\" * La variable Trans Masculino no debe ser mayor al Total Mujeres.\",\"\"))","v":""},{"$f":"IF(AND(C22>0,OR(AH22=\"\")),\" * No olvide digitar la variable Trans Femenino (Digite Cero si no tiene).\",IF(AH22>C22,\" * La variable Trans Femenino no debe ser mayor al Total Hombres.\",\"\"))","v":""},{"$f":"IF($AI22<=$B22,\"\",\"* La celda de Pueblos Originarios no debe ser mayor al Total. \")","v":""},{"$f":"IF($AJ22<=$B22,\"\",\"* La celda de Población Migrantes no debe ser mayor al Total. \")","v":""},null,{"$f":"IF(AND($B22<>0,$AI22=\"\"),\"* No olvide escribir en la celda de Pueblos Originarios (Digite CERO si no tiene). \",\"\")","v":""},{"$f":"IF(AND($B22<>0,$AJ22=\"\"),\"* No olvide escribir en la celda de Población Migrantes (Digite CERO si no tiene). \",\"\")","v":""},null,null,null,null,{"$f":"IF(AND(D22>0,OR(AG22=\"\")),1,IF((AG22)>D22,1,0))","v":0},{"$f":"IF(AND(C22>0,OR(AH22=\"\")),1,IF((AH22)>C22,1,0))","v":0},null,null,{"$f":"IF($AI22<=$B22,0,1)","v":0},{"$f":"IF($AJ22<=$B22,0,1)","v":0},null,{"$f":"IF(AND($B22<>0,$AI22=\"\"),1,0)","v":0},{"$f":"IF(AND($B22<>0,$AJ22=\"\"),1,0)","v":0}]
[]
[]
[]
[]
[]
[]
[]
[]
[]
[]
[{"$f":"SUM(D12:D17,B22)","v":0},"datos"]
[{"$f":"SUM(CM12:CW22)","v":0},"errores"]

{"sheet":"P12","index":10,"n_rows":200,"n_cols":13,"rows_kept":200,"cut":false,"hidden":false,"merged":[[116,0,118,0],[116,1,116,6],[117,1,118,1],[117,2,118,2],[117,3,117,5],[117,6,118,6],[115,0,115,10],[98,0,98,10],[99,0,101,0],[99,1,99,6],[100,1,101,1],[100,2,101,2],[100,3,100,5],[100,6,101,6],[23,0,23,2],[4,13,4,14],[6,0,6,10],[24,0,24,10],[26,5,26,10],[25,0,27,0],[26,1,27,1],[26,2,27,2],[26,3,26,4],[25,1,25,11],[26,11,27,11],[42,0,42,2],[43,0,43,10],[44,0,46,0],[45,1,46,1],[45,2,46,2],[45,3,45,4],[45,5,45,10],[44,1,44,11],[45,11,46,11]]}
["DATOS DEL ESTABLECIMIENTO"]
[{"$f":"CONCATENATE(\"COMUNA: \",NOMBRE!$B$2,\" - \",\"( \",NOMBRE!$C$2,NOMBRE!$D$2,NOMBRE!$E$2,NOMBRE!$F$2,NOMBRE!$G$2,\" )\")","v":"COMUNA:  - (  )"}]
[{"$f":"CONCATENATE(\"ESTABLECIMIENTO/ESTRATEGIA: \",NOMBRE!$B$3,\" - \",\"( \",NOMBRE!$C$3,NOMBRE!$D$3,NOMBRE!$E$3,NOMBRE!$F$3,NOMBRE!$G$3,NOMBRE!$H$3,\" )\")","v":"ESTABLECIMIENTO/ESTRATEGIA:  - (  )"}]
[{"$f":"CONCATENATE(\"MES: \",NOMBRE!$B$6,\" - \",\"( \",NOMBRE!$C$6,NOMBRE!$D$6,\" )\")","v":"MES:  - (  )"}]
[{"$f":"CONCATENATE(\"AÑO: \",NOMBRE!$B$7)","v":"AÑO: 2024"}]
[]
["REM-P12. PERSONAS CON TAMIZAJE PARA LA DETECCIÓN PRECOZ DE CÁNCER DE CUELLO UTERINO – \nMAMOGRAFIA - EXAMEN FISICO DE MAMA VIGENTES Y PRODUCCION DE PAP Y VPH (SEMESTRAL)"]
["SECCION A: PROGRAMA DE CANCER DE CUELLO UTERINO: POBLACIÓN CON TAMIZAJE VIGENTE \nPARA LA DETECCIÓN PRECOZ DEL CÁNCER DE CUELLO UTERINO"]
["GRUPOS DE EDAD (en años)","Mujeres\ncon Tamizaje Vigente \npara la Detección Precoz de Cáncer de Cuello Uterino","Trans Masculino\ncon Tamizaje Vigente \npara la Detección Precoz de Cáncer de Cuello Uterino"]
["Menor de 25 años",null,null,{"$f":"AA10&AB10","v":""}]
["25 a 29 años ",null,null,{"$f":"AA11&AB11","v":""}]
["30 a 34 años",null,null,""]
["35 a 39 años",null,null,""]
["40 a 44 años",null,null,""]
["45 a 49 años",null,null,""]
["50 a 54 años",null,null,""]
["55 a 59 años",null,null,""]
["60 a 64 años",null,null,""]
["65 a 69 años",null,null,""]
["70 a 74 años",null,null,""]
["75 a 79 años",null,null,""]
["80 y más años",null,null,""]
["TOTAL",{"$f":"SUM(B10:B22)","v":0},{"$f":"SUM(C10:C22)","v":0}]
["(*) FUENTE DE INFORMACIÓN: CITOEXPERT O REVICAN"]
["SECCIÓN B. PROGRAMA DE CANCER DE CUELLO UTERINO: PAP REALIZADOS E INFORMADOS SEGÚN RESULTADOS Y GRUPOS DE EDAD\n(Examen realizados en la red pública)"]
["GRUPO DE EDAD \n(en años)","PAP INFORMADOS SEGÚN RESULTADO"]
[null,"TOTAL","NORMALES","INADECUADOS Y ATIPICOS",null,"POSITIVOS",null,null,null,null,null,"TOTAL PAP INFORMADOS EN TRANS MASCULINO "]
[null,null,null,"INADECUADOS","ATIPICOS"," HPV","NIE I","NIE II"," NIE III","Ca. Inv. (Epidermoide)","Ca. Inv. (Adenocarcinoma)"]
["Menor de 25 años",{"$f":"SUM(C29:K29)","v":0},null,null,null,null,null,null,null,null,null,null,{"$f":"AA29&AB29","v":""}]
["25 a 29 años ",{"$f":"SUM(C30:K30)","v":0},null,null,null,null,null,null,null,null,null,null,{"$f":"AA30&AB30","v":""}]
["30 a 34 años",0,null,null,null,null,null,null,null,null,null,null,""]
["35 a 39 años",0,null,null,null,null,null,null,null,null,null,null,""]
["40 a 44 años",0,null,null,null,null,null,null,null,null,null,null,""]
["45 a 49 años",0,null,null,null,null,null,null,null,null,null,null,""]
["50 a 54 años",0,null,null,null,null,null,null,null,null,null,null,""]
["55 a 59 años",0,null,null,null,null,null,null,null,null,null,null,""]
["60 a 64 años",{"$f":"SUM(C37:K37)","v":0},null,null,null,null,null,null,null,null,null,null,""]
["65 a 69 años",0,null,null,null,null,null,null,null,null,null,null,""]
["70 a 74 años",0,null,null,null,null,null,null,null,null,null,null,""]
["75 a 79 años",0,null,null,null,null,null,null,null,null,null,null,""]
["80 y más años",0,null,null,null,null,null,null,null,null,null,null,""]
["TOTAL",{"$f":"SUM(C42:K42)","v":0},{"$f":"SUM(C29:C41)","v":0},{"$f":"SUM(D29:D41)","v":0},0,0,0,0,0,0,0,{"$f":"SUM(L29:L41)","v":0}]
["(*) FUENTE DE INFORMACIÓN: CITOEXPERT O REVICAN"]
["SECCIÓN B.1 PROGRAMA DE CANCER DE CUELLO UTERINO: PAP REALIZADOS E INFORMADOS SEGÚN RESULTADOS Y GRUPOS DE EDAD\n(Examen realizados en extrasistema)"]
["GRUPO DE EDAD \n(en años)","PAP INFORMADOS SEGÚN RESULTADO"]
[null,"TOTAL","NORMALES","INADECUADOS Y ATIPICOS",null,"POSITIVOS",null,null,null,null,null,"TOTAL PAP INFORMADOS EN TRANS MASCULINO "]
[null,null,null,"INADECUADOS","ATIPICOS"," HPV","NIE I","NIE II"," NIE III","Ca. Inv. (Epidermoide)","Ca. Inv. (Adenocarcinoma)"]
["Menor de 25 años",{"$f":"SUM(C48:K48)","v":0},null,null,null,null,null,null,null,null,null,null,{"$f":"AA48&AB48","v":""}]
["25 a 29 años ",{"$f":"SUM(C49:K49)","v":0},null,null,null,null,null,null,null,null,null,null,{"$f":"AA49&AB49","v":""}]
["30 a 34 años",{"$f":"SUM(C50:K50)","v":0},null,null,null,null,null,null,null,null,null,null,""]
["35 a 39 años",0,null,null,null,null,null,null,null,null,null,null,""]
["40 a 44 años",0,null,null,null,null,null,null,null,null,null,null,""]
["45 a 49 años",0,null,null,null,null,null,null,null,null,null,null,""]
["50 a 54 años",0,null,null,null,null,null,null,null,null,null,null,""]
["55 a 59 años",0,null,null,null,null,null,null,null,null,null,null,""]
["60 a 64 años",0,null,null,null,null,null,null,null,null,null,null,""]
["65 a 69 años",0,null,null,null,null,null,null,null,null,null,null,""]
["70 a 74 años",{"$f":"SUM(C58:K58)","v":0},null,null,null,null,null,null,null,null,null,null,""]
["75 a 79 años",{"$f":"SUM(C59:K59)","v":0},null,null,null,null,null,null,null,null,null,null,""]
["80 y más años",{"$f":"SUM(C60:K60)","v":0},null,null,null,null,null,null,null,null,null,null,""]
["TOTAL",{"$f":"SUM(C61:K61)","v":0},{"$f":"SUM(C48:C60)","v":0},{"$f":"SUM(D48:D60)","v":0},{"$f":"SUM(E48:E60)","v":0},0,0,0,0,0,0,{"$f":"SUM(L48:L60)","v":0}]
["(*) FUENTE DE INFORMACIÓN: CITOEXPERT O REVICAN"]
["SECCION C: PROGRAMA DE CANCER DE MAMA: MUJERES CON MAMOGRAFÍA VIGENTE EN LOS ULTIMOS 2 AÑOS. "]
["GRUPO DE EDAD \n(en años)","Mujeres con mamografia vigente  (Menor o igual a 2 años)"]
["Menor de 35 años"]
["35 a 49 años"]
["50 a 54 años"]
["55 a 59 años"]
["60 a 64 años"]
["65 a 69 años"]
["70 a 74 años"]
["75 a 79 años"]
["80 y más años"]
["TOTAL",{"$f":"SUM(B65:B73)","v":0}]
["(*) FUENTE DE INFORMACIÓN: TARJETERO POBLACIONAL DE LA APS"]
["SECCION D: PROGRAMA DE CANCER DE MAMA: NÚMERO DE MUJERES CON EXAMEN FÍSICO DE MAMA (VIGENTE)"]
["GRUPO DE EDAD \n(en años)","Mujeres con EFM vigente\n"]
["Menor de 35 años"]
["35 a 49 años"]
["50 a 54 años"]
["55 a 59 años"]
["60 a 64 años"]
["65 a 69 años"]
["70 a 74 años"]
["75 a 79 años"]
["80 y más años"]
["TOTAL",{"$f":"SUM(B78:B86)","v":0}]
["(*) FUENTE DE INFORMACIÓN: TARJETERO POBLACIONAL DE LA APS"]
["SECCION E: PROGRAMA DE CANCER DE CUELLO UTERINO: POBLACIÓN CON VPH VIGENTE"]
["GRUPOS DE EDAD (en años)","MUJERES\ncon Examen VPH Vigente \nen los ultimos 5 años","TRANS MASCULINO\ncon Examen VPH Vigente \nen los ultimos 5 años"]
["30 a 34 años",null,null,{"$f":"AA91&AB91","v":""}]
["35 a 39 años",null,null,{"$f":"AA92&AB92","v":""}]
["40 a 44 años",null,null,""]
["45 a 49 años",null,null,""]
["50 a 54 años",null,null,""]
["55 a 59 años",null,null,""]
["60 a 64 años",null,null,""]
["TOTAL",{"$f":"SUM(B91:B97)","v":0},{"$f":"SUM(C91:C97)","v":0}]
["SECCIÓN F: PROGRAMA DE CANCER DE CUELLO UTERINO: RESULTADOS DE VPH  REALIZADOS EN EL SISTEMA PUBLICO SEGÚN GRUPOS DE EDAD \n(Examen realizados en la red pública)"]
["GRUPO DE EDAD \n(en años)","VPH INFORMADOS SEGÚN RESULTADO"]
[null,"TOTAL","VPH (-)","POSITIVOS",null,null,"TOTAL VPH  INFORMADOS EN TRANS MASCULINO "]
[null,null,null,"VPH 16 (+)","VPH 18 (+)","VPH AR* (+) "]
["30 a 34 años",{"$f":"SUM(C103:F103)","v":1},1,null,null,null,null,{"$f":"AA103&AB103","v":""}]
["35 a 39 años",{"$f":"SUM(C104:F104)","v":0},null,null,null,null,null,{"$f":"AA104&AB104","v":""}]
["40 a 44 años",0,null,null,null,null,null,""]
["45 a 49 años",0,null,null,null,null,null,""]
["50 a 54 años",0,null,null,null,null,null,""]
["55 a 59 años",0,null,null,null,null,null,""]
["60 a 64 años",0,null,null,null,null,null,""]
["65 a 69 años",0,null,null,null,null,null,""]
["70 a 74 años",0,null,null,null,null,null,""]
["75 a 79 años",0,null,null,null,null,null,""]
["80 y más años",0,null,null,null,null,null,""]
["TOTAL",{"$f":"SUM(C114:F114)","v":1},{"$f":"SUM(C103:C113)","v":1},{"$f":"SUM(D103:D113)","v":0},{"$f":"SUM(E103:E113)","v":0},{"$f":"SUM(F103:F113)","v":0},{"$f":"SUM(G103:G113)","v":0}]
["* Agrupados Alto Riesgo"]
["SECCIÓN F.1: PROGRAMA DE CANCER DE CUELLO UTERINO: RESULTADOS DE  VPH, REALIZADOS EN EL EXTRASISTEMA SEGÚN  GRUPOS DE EDAD\n(Exámenes realizados en extrasistema)"]
["GRUPO DE EDAD \n(en años)","VPH INFORMADOS SEGÚN RESULTADO"]
[null,"TOTAL","VPH (-)","POSITIVOS",null,null,"TOTAL VPH  INFORMADOS EN TRANS MASCULINO "]
[null,null,null,"VPH 16 (+)","VPH 18 (+)","VPH AR (+) "]
["30 a 34 años",{"$f":"SUM(C120:F120)","v":0},null,null,null,null,null,{"$f":"AA120&AB120","v":""}]
["35 a 39 años",{"$f":"SUM(C121:F121)","v":0},null,null,null,null,null,""]
["40 a 44 años",0,null,null,null,null,null,""]
["45 a 49 años",0,null,null,null,null,null,""]
["50 a 54 años",0,null,null,null,null,null,""]
["55 a 59 años",0,null,null,null,null,null,""]
["60 a 64 años",0,null,null,null,null,null,""]
["65 a 69 años",0,null,null,null,null,null,""]
["70 a 74 años",0,null,null,null,null,null,""]
["75 a 79 años",0,null,null,null,null,null,""]
["80 y más años",0,null,null,null,null,null,""]
["TOTAL",{"$f":"SUM(C131:F131)","v":0},{"$f":"SUM(C120:C130)","v":0},{"$f":"SUM(D120:D130)","v":0},{"$f":"SUM(E120:E130)","v":0},{"$f":"SUM(F120:F130)","v":0},{"$f":"SUM(G120:G130)","v":0}]
[]
[]
[]
[]
[]
[]
[]
[]
[]
[]
[]
[]
[]
[]
[]
[]
[]
[]
[]
[]
[]
[]
[]
[]
[]
[]
[]
[]
[]
[]
[]
[]
[]
[]
[]
[]
[]
[]
[]
[]
[]
[]
[]
[]
[]
[]
[]
[]
[]
[]
[]
[]
[]
[]
[]
[]
[]
[]
[]
[]
[]
[]
[]
[]
[]
[]
[]
[{"$f":"SUM(B10:C22,C29:L41,C48:L60,B65:B73,B78:B86,B91:C97,C103:G113,C120:G130)","v":1},"datos"]
[{"$f":"SUM(AE$10:AE130)","v":0},"errores"]

{"sheet":"P13","index":11,"n_rows":41,"n_cols":73,"rows_kept":41,"cut":false,"hidden":false,"merged":[[6,0,6,17],[9,12,9,13],[9,14,9,15],[9,8,9,9],[17,18,19,18],[8,0,10,0],[8,1,9,3],[8,4,8,15],[17,0,19,0],[17,1,18,3],[17,4,17,15],[18,4,18,5],[18,6,18,7],[18,8,18,9],[9,4,9,5],[9,6,9,7],[18,10,18,11],[18,12,18,13],[18,14,18,15],[9,10,9,11],[17,19,19,19],[17,17,19,17],[8,17,10,17],[8,16,10,16],[17,16,19,16]]}
["DATOS DEL ESTABLECIMIENTO"]
[{"$f":"CONCATENATE(\"COMUNA: \",NOMBRE!$B$2,\" - \",\"( \",NOMBRE!$C$2,NOMBRE!$D$2,NOMBRE!$E$2,NOMBRE!$F$2,NOMBRE!$G$2,\" )\")","v":"COMUNA:  - (  )"}]
[{"$f":"CONCATENATE(\"ESTABLECIMIENTO/ESTRATEGIA: \",NOMBRE!$B$3,\" - \",\"( \",NOMBRE!$C$3,NOMBRE!$D$3,NOMBRE!$E$3,NOMBRE!$F$3,NOMBRE!$G$3,NOMBRE!$H$3,\" )\")","v":"ESTABLECIMIENTO/ESTRATEGIA:  - (  )"}]
[{"$f":"CONCATENATE(\"MES: \",NOMBRE!$B$6,\" - \",\"( \",NOMBRE!$C$6,NOMBRE!$D$6,\" )\")","v":"MES:  - (  )"}]
[{"$f":"CONCATENATE(\"AÑO: \",NOMBRE!$B$7)","v":"AÑO: 2024"}]
[]
["REM-P13. NIÑOS, NIÑAS, ADOLESCENTES Y JÓVENES CON VULNERACIÓN DE DERECHOS Y/O INFRACCIÓN A LA LEY BAJO LA PROTECCIÓN DEL ESTADO EN ATENCIÓN"]
["SECCIÓN A: NIÑOS, NIÑAS, ADOLESCENTES Y JÓVENES CON VULNERACIÓN DE DERECHOS Y/O INFRACCIÓN A LA LEY EN CONTROL DE SALUD EN APS AL CORTE"]
["Tipo de Programas SENAME","TOTAL",null,null,"POR EDAD ",null,null,null,null,null,null,null,null,null,null,null,"Migrantes","Pueblos Originarios"]
[null,null,null,null," 0 - 4",null," 5 - 9",null," 10 - 14 ",null,"15 a 19",null,"20 - 24",null,"Mayor a 25 años"]
[null,"Ambos sexos","Hombre","Mujer","Hombre","Mujer","Hombre","Mujer","Hombre","Mujer","Hombre","Mujer","Hombre","Mujer","Hombre","Mujer"]
["TOTAL",{"$f":"SUM(C12:D12)","v":0},{"$f":"SUM(C13:C16)","v":0},{"$f":"SUM(D13:D16)","v":0},{"$f":"SUM(E13:E16)","v":0},{"$f":"SUM(F13:F15)","v":0},{"$f":"SUM(G13:G15)","v":0},{"$f":"SUM(H13:H15)","v":0},{"$f":"SUM(I13:I16)","v":0},0,0,0,0,0,0,0,{"$f":"SUM(Q13:Q16)","v":0},{"$f":"SUM(R13:R16)","v":0},{"$f":"BA12&BB12&BC12&BD12","v":""}]
["AMBULATORIO (SPE Mejor Niñez)",{"$f":"SUM(C13:D13)","v":0},{"$f":"+E13+G13+I13+K13+M13+O13","v":0},0,null,null,null,null,null,null,null,null,null,null,null,null,null,null,"",null,null,null,null,null,null,null,null,null,null,null,null,null,null,null,null,null,null,null,null,null,null,null,null,null,null,null,null,null,null,null,null,null,{"$f":"IF(BP13=1,\" * El total de Migrantes no debe superar el Total. \",\"\")","v":""},{"$f":"IF(BQ13=1,\"* No olvide ingresar la columna Migrantes (Digite Cero si no tiene). \",\"\")","v":""},{"$f":"IF(BR13=1,\" * El total de Pueblos Originarios no debe superar el Total. \",\"\")","v":""},{"$f":"IF(BS13=1,\"* No olvide ingresar la columna Pueblos Originarios (Digite Cero si no tiene). \",\"\")","v":""},null,null,null,null,null,null,null,null,null,null,null,{"$f":"IF(Q13>B13,1,0)","v":0},{"$f":"IF(AND(B13<>0,Q13=\"\"),1,0)","v":0},{"$f":"IF(R13>B13,1,0)","v":0},{"$f":"IF(AND(B13<>0,R13=\"\"),1,0)","v":0}]
["SANCIÓN MEDIO LIBRE (SENAME)",{"$f":"SUM(C14:D14)","v":0},0,0,null,null,null,null,null,null,null,null,null,null,null,null,null,null,"",null,null,null,null,null,null,null,null,null,null,null,null,null,null,null,null,null,null,null,null,null,null,null,null,null,null,null,null,null,null,null,null,null,{"$f":"IF(BP14=1,\" * El total de Migrantes no debe superar el Total. \",\"\")","v":""},{"$f":"IF(BQ14=1,\"* No olvide ingresar la columna Migrantes (Digite Cero si no tiene). \",\"\")","v":""},{"$f":"IF(BR14=1,\" * El total de Pueblos Originarios no debe superar el Total. \",\"\")","v":""},{"$f":"IF(BS14=1,\"* No olvide ingresar la columna Pueblos Originarios (Digite Cero si no tiene). \",\"\")","v":""},null,null,null,null,null,null,null,null,null,null,null,{"$f":"IF(Q14>B14,1,0)","v":0},{"$f":"IF(AND(B14<>0,Q14=\"\"),1,0)","v":0},{"$f":"IF(R14>B14,1,0)","v":0},{"$f":"IF(AND(B14<>0,R14=\"\"),1,0)","v":0}]
["RESIDENCIALES (SPE Mejor Niñez)",{"$f":"SUM(C15:D15)","v":0},0,0,null,null,null,null,null,null,null,null,null,null,null,null,null,null,"",null,null,null,null,null,null,null,null,null,null,null,null,null,null,null,null,null,null,null,null,null,null,null,null,null,null,null,null,null,null,null,null,null,"",{"$f":"IF(BQ15=1,\"* No olvide ingresar la columna Migrantes (Digite Cero si no tiene). \",\"\")","v":""},"",{"$f":"IF(BS15=1,\"* No olvide ingresar la columna Pueblos Originarios (Digite Cero si no tiene). \",\"\")","v":""},null,null,null,null,null,null,null,null,null,null,null,{"$f":"IF(Q15>B15,1,0)","v":0},{"$f":"IF(AND(B15<>0,Q15=\"\"),1,0)","v":0},{"$f":"IF(R15>B15,1,0)","v":0},{"$f":"IF(AND(B15<>0,R15=\"\"),1,0)","v":0}]
["CIP-CRC (Medio Privativo)",{"$f":"SUM(C16:D16)","v":0},{"$f":"I16+K16+M16+O16","v":0},{"$f":"+J16+L16+N16+P16","v":0},null,null,null,null,null,null,null,null,null,null,null,null,null,null,{"$f":"BA16&BB16&BC16&BD16","v":""},null,null,null,null,null,null,null,null,null,null,null,null,null,null,null,null,null,null,null,null,null,null,null,null,null,null,null,null,null,null,null,null,null,"",{"$f":"IF(BQ16=1,\"* No olvide ingresar la columna Migrantes (Digite Cero si no tiene). \",\"\")","v":""},"","",null,null,null,null,null,null,null,null,null,null,null,{"$f":"IF(Q16>B16,1,0)","v":0},{"$f":"IF(AND(B16<>0,Q16=\"\"),1,0)","v":0},{"$f":"IF(R16>B16,1,0)","v":0},{"$f":"IF(AND(B16<>0,R16=\"\"),1,0)","v":0}]
["SECCIÓN B: VARIABLES DE SEGUIMIENTO A POBLACIÓN DEL SERVICIO DE PROTECCIÓN ESPECIALIZADA MEJOR NIÑEZ Y SENAME EN CONTROL DE SALUD EN APS AL CORTE"]
["Variable","TOTAL",null,null,"POR EDAD ",null,null,null,null,null,null,null,null,null,null,null,"Migrantes","Pueblos Originarios","Niños, Niñas, Adolescentes y Jóvenes Mejor Niñez","Niños, Niñas, Adolescentes y Jóvenes SENAME"]
[null,null,null,null," 0 - 4",null," 5 - 9",null," 10 - 14 ",null,"15 a 19",null,"20 a 24",null,"Mayor a 25 años"]
[null,"Ambos sexos","Hombre","Mujer","Hombre","Mujer","Hombre","Mujer","Hombre","Mujer","Hombre","Mujer","Hombre","Mujer","Hombre","Mujer"]
["POBLACIÓN EN CONTROL CON MÉTODO DE REGULACIÓN DE FERTILIDAD",{"$f":"SUM(C21:D21)","v":0},{"$f":"+I21+K21+M21+O21","v":0},{"$f":"+J21+L21+N21+P21","v":0},null,null,null,null,null,null,null,null,null,null,null,null,null,null,null,null,{"$f":"BA21&BB21&BC21&BD21&BE21&BF21","v":""},null,null,null,null,null,null,null,null,null,null,null,null,null,null,null,null,null,null,null,null,null,null,null,null,null,null,null,null,null,null,null,{"$f":"IF(BP21=1,\" * El total de Migrantes no debe superar el Total. \",\"\")","v":""},{"$f":"IF(BQ21=1,\"* No olvide ingresar la columna Migrantes (Digite Cero si no tiene). \",\"\")","v":""},{"$f":"IF(BR21=1,\" * El total de Pueblos Originarios no debe superar el Total. \",\"\")","v":""},{"$f":"IF(BS21=1,\"* No olvide ingresar la columna Pueblos Originarios (Digite Cero si no tiene). \",\"\")","v":""},{"$f":"IF(AND(B21>0,S21=\"\"),\" * No olvide digitar la columna Niños, niñas, adolescentes y jóvenes Mejor niñez. Digite cero si no tiene.\",IF(S21>B21,\" * La variable niños, niñas, adolescentes y jóvenes Mejor niñez no puede ser mayor al Total.\",\"\"))","v":""},{"$f":"IF(AND(B21>0,T21=\"\"),\" * No olvide digitar la columna Niños, niñas, adolescentes y jóvenes SENAME. Digite cero si no tiene.\",IF(T21>B21,\" * La variable niños, niñas, adolescentes y jóvenes SENAME no puede ser mayor al Total.\",\"\"))","v":""},null,null,null,null,null,null,null,null,null,{"$f":"IF(Q21>B21,1,0)","v":0},{"$f":"IF(AND(B21<>0,Q21=\"\"),1,0)","v":0},{"$f":"IF(R21>B21,1,0)","v":0},{"$f":"IF(AND(B21<>0,R21=\"\"),1,0)","v":0},{"$f":"IF(AND(B21>0,S21=\"\"),1,IF(S21>B21,1,0))","v":0},{"$f":"IF(AND(B21>0,T21=\"\"),1,IF(T21>B21,1,0))","v":0}]
["GESTANTES EN CONTROL CON RIESGO PSICOSOCIAL",0,{"$f":"+I22+K22+M22+O22","v":0},{"$f":"+J22+L22+N22+P22","v":0},null,null,null,null,null,null,null,null,null,null,null,null,null,null,null,null,{"$f":"BA22&BB22&BC22&BD22&BE22&BF22","v":""},null,null,null,null,null,null,null,null,null,null,null,null,null,null,null,null,null,null,null,null,null,null,null,null,null,null,null,null,null,null,null,{"$f":"IF(BP22=1,\" * El total de Migrantes no debe superar el Total. \",\"\")","v":""},"",{"$f":"IF(BR22=1,\" * El total de Pueblos Originarios no debe superar el Total. \",\"\")","v":""},"",{"$f":"IF(AND(B22>0,S22=\"\"),\" * No olvide digitar la columna Niños, niñas, adolescentes y jóvenes Mejor niñez. Digite cero si no tiene.\",IF(S22>B22,\" * La variable niños, niñas, adolescentes y jóvenes Mejor niñez no puede ser mayor al Total.\",\"\"))","v":""},{"$f":"IF(AND(B22>0,T22=\"\"),\" * No olvide digitar la columna Niños, niñas, adolescentes y jóvenes SENAME. Digite cero si no tiene.\",IF(T22>B22,\" * La variable niños, niñas, adolescentes y jóvenes SENAME no puede ser mayor al Total.\",\"\"))","v":""},null,null,null,null,null,null,null,null,null,0,0,0,0,{"$f":"IF(AND(B22>0,S22=\"\"),1,IF(S22>B22,1,0))","v":0},{"$f":"IF(AND(B22>0,T22=\"\"),1,IF(T22>B22,1,0))","v":0}]
["POBLACIÓN INFANTIL EN CONTROL",0,{"$f":"+E23+G23","v":0},{"$f":"+F23+H23","v":0},null,null,null,null,null,null,null,null,null,null,null,null,null,null,null,null,"",null,null,null,null,null,null,null,null,null,null,null,null,null,null,null,null,null,null,null,null,null,null,null,null,null,null,null,null,null,null,null,"","","","","","",null,null,null,null,null,null,null,null,null,0,0,0,0,0,0]
["POBLACIÓN EN CONTROL DE SALUD INTEGRAL DE ADOLESCENTES SEGÚN ÁREA DE RIESGO",0,{"$f":"+I24+K24+M24+O24","v":0},{"$f":"+J24+L24+N24+P24","v":0},null,null,null,null,null,null,null,null,null,null,null,null,null,null,null,null,"",null,null,null,null,null,null,null,null,null,null,null,null,null,null,null,null,null,null,null,null,null,null,null,null,null,null,null,null,null,null,null,"","","","","","",null,null,null,null,null,null,null,null,null,0,0,0,0,0,0]
["POBLACIÓN EN CONTROL DE SALUD MENTAL",0,{"$f":"+E25+G25+I25+K25+M25+O25","v":0},{"$f":"+F25+H25+J25+L25+N25+P25","v":0},null,null,null,null,null,null,null,null,null,null,null,null,null,null,null,null,"",null,null,null,null,null,null,null,null,null,null,null,null,null,null,null,null,null,null,null,null,null,null,null,null,null,null,null,null,null,null,null,"","","","","","",null,null,null,null,null,null,null,null,null,0,0,0,0,0,0]
["POBLACIÓN EN PROGRAMA DE ACOMPAÑAMIENTO PSICOSOCIAL",{"$f":"SUM(C26:D26)","v":0},{"$f":"+E26+G26+I26+K26+M26","v":0},{"$f":"+F26+H26+J26+L26+N26","v":0},null,null,null,null,null,null,null,null,null,null,null,null,null,null,null,null,"",null,null,null,null,null,null,null,null,null,null,null,null,null,null,null,null,null,null,null,null,null,null,null,null,null,null,null,null,null,null,null,"","","","","","",null,null,null,null,null,null,null,null,null,0,0,0,0,0,0]
[]
[]
[]
[]
[]
[]
[]
[]
[]
[]
[]
[]
[]
[{"$f":"SUM(B12:B16,B21:B26)","v":0},"datos"]
[{"$f":"SUM(BP13:BU26)","v":0},"errores"]

{"sheet":"Control","index":12,"n_rows":17,"n_cols":23,"rows_kept":17,"cut":false,"hidden":false,"merged":[[0,2,0,4]]}
[null,null,"NUMERO DE ERRORES Y COMPLETITUD DE REM SERIE P"]
[null,null,{"$f":"CONCATENATE(\"ESTABLECIMIENTO/ESTRATEGIA: \",NOMBRE!$B$3,\" - \",\"( \",NOMBRE!$C$3,NOMBRE!$D$3,NOMBRE!$E$3,NOMBRE!$F$3,NOMBRE!$G$3,NOMBRE!$H$3,NOMBRE!$I$3,\" )\")","v":"ESTABLECIMIENTO/ESTRATEGIA:  - ( Falta Cód. Est. )"}]
[null,null,"REM","Nº ERRORES","REM\nSIN DATOS"]
[null,null,"HOJA NOMBRE",{"$f":"NOMBRE!AG7","v":3}]
[null,null,"REM P1",{"$f":"+'P1'!$A164","v":0},{"$f":"IF('P1'!A163>0,\"\",\"SIN DATOS\")","v":"SIN DATOS"},null,null,null,null,null,null,null,null,null,null,null,null,null,null,null,null,null,"Licencia médica"]
[null,null,"REM P2",{"$f":"+'P2'!A220","v":0},{"$f":"IF('P2'!A219>0,\"\",\"SIN DATOS\")","v":"SIN DATOS"},null,null,null,null,null,null,null,null,null,null,null,null,null,null,null,null,null,"Feriado Legal"]
[null,null,"REM P3",{"$f":"+'P3'!A88","v":0},{"$f":"IF('P3'!A87>0,\"\",\"SIN DATOS\")","v":"SIN DATOS"},null,null,null,null,null,null,null,null,null,null,null,null,null,null,null,null,null,"No hubo profesional"]
[null,null,"REM P4",{"$f":"+'P4'!A101","v":0},{"$f":"IF('P4'!A100>0,\"\",\"SIN DATOS\")","v":"SIN DATOS"},null,null,null,null,null,null,null,null,null,null,null,null,null,null,null,null,null,"No corresponde REM"]
[null,null,"REM P5",{"$f":"+'P5'!A82","v":0},{"$f":"IF('P5'!A81>0,\"\",\"SIN DATOS\")","v":"SIN DATOS"},null,null,null,null,null,null,null,null,null,null,null,null,null,null,null,null,null,"Otra causa justificada"]
[null,null,"REM P6",{"$f":"+'P6'!A138","v":0},{"$f":"IF('P6'!A137>0,\"\",\"SIN DATOS\")","v":"SIN DATOS"}]
[null,null,"REM P7",{"$f":"+'P7'!A50","v":0},{"$f":"IF('P7'!A49>0,\"\",\"SIN DATOS\")","v":"SIN DATOS"}]
[null,null,"REM P9",{"$f":"+'P9'!A106","v":0},{"$f":"IF('P9'!A105>0,\"\",\"SIN DATOS\")","v":"SIN DATOS"}]
[null,null,"REM P11",{"$f":"+'P11'!A34","v":0},{"$f":"IF('P11'!A33>0,\"\",\"SIN DATOS\")","v":"SIN DATOS"}]
[null,null,"REM P12",{"$f":"+'P12'!A200","v":0},{"$f":"IF('P12'!A200>0,\"\",\"SIN DATOS\")","v":"SIN DATOS"}]
[null,null,"REM P13",{"$f":"+'P13'!A41","v":0},{"$f":"IF('P13'!A40>0,\"\",\"SIN DATOS\")","v":"SIN DATOS"}]
[]
[null,null,"TOTAL",{"$f":"SUM(D4:D15)","v":3}]

{"sheet":"MACROS","index":13,"n_rows":13,"n_cols":2,"rows_kept":13,"cut":false,"hidden":false,"merged":[[0,0,0,13],[9,1,10,7]]}
["Hoja de Macros y Utilidades"]
[]
[{"$f":"CONCATENATE(\"ESTABLECIMIENTO/ESTRATEGIA: \",NOMBRE!B3,\" - \",\"( \",NOMBRE!C3,NOMBRE!D3,NOMBRE!E3,NOMBRE!F3,NOMBRE!G3,NOMBRE!H3,\" )\")","v":"ESTABLECIMIENTO/ESTRATEGIA:  - (  )"}]
[null,"DESPROTEGER HOJAS"]
[]
[null,"PROTEGER HOJAS"]
[]
[null,"CREA UNA COPIA DEL ARCHIVO (TRANFORMA HOJAS A VALORES)"]
[]
[null,{"$f":"IF(Control!D17>0,\"REVISE LA HOJA CONTROL, EXISTEN ERRORES\",\"\")","v":"REVISE LA HOJA CONTROL, EXISTEN ERRORES"}]
[]
[]
[null,"Contraseña para copia del archivo :DEIS"]